program: Gaussian 09
title: 000054883
version: EM64L-G09RevD.01
frameworkgroup: C1[X(C7H7Cl2N3O6)]
method: RPBEPBE
basis: SDD
operation: Freq
keyword: #p
keyword: freq=noraman
keyword: PBEPBE/SDD
title: #p freq=noraman PBEPBE/SDD
converged: YES YES NO NO
title: Mulliken charges:
elementType: Cl Cl O O O O O O N N N C C C C C C C H H H H H H H
charge: 0.055718 0.086143 -0.255712 -0.182723 -0.150299 -0.180079 -0.215703 -0.183008 -0.321527 0.104480 -0.380976 0.133436 -0.160287 0.194150 -0.692183 0.191873 0.470138 -0.713629 0.340569 0.266234 0.239821 0.257540 0.373443 0.371492 0.351088
chargesum: 0.00000
title: Mulliken charges with hydrogens summed into heavy atoms:
elementType: Cl Cl O O O O O O N N N C C C C C C C
charge: 0.055718 0.086143 -0.255712 -0.182723 -0.150299 -0.180079 -0.215703 -0.183008 0.051916 0.104480 -0.009484 0.133436 0.180282 0.194150 0.071412 0.191873 0.470138 -0.362541
polarizability: 1.46994304e+02 -1.71074904e+00 1.45908974e+02 -1.03892929e+01 -5.53280300e+00 1.11802185e+02
1716.lowfreq: -6.3034 -5.4709 -0.0028 -0.0013 0.0004 4.0106 10.4542 32.1684 43.6263
frequency: 9.3626 32.1365 43.6154 52.3321 61.0359 76.5389 126.6536 143.0379 163.5038 175.2746 182.4908 187.9229 206.4153 247.5895 278.5354 290.2202 295.4604 343.5340 349.3658 380.4159 443.3688 475.8746 529.6648 539.5312 585.5060 599.9576 634.9942 652.0214 674.1517 690.3137 708.7630 727.4357 739.7433 756.8067 761.1994 768.5776 805.4464 859.5477 907.0914 919.2259 973.0230 1073.2747 1078.7501 1128.0545 1152.8708 1191.3915 1199.1108 1217.8994 1247.7424 1256.3339 1306.4594 1341.6881 1380.8709 1389.7702 1394.5088 1422.3321 1437.4523 1460.2807 1470.7903 1653.4847 1661.4256 1685.9541 3019.3189 3085.8034 3126.5726 3131.2446 3147.2110 3520.2191 3550.4343
redmass: 16.0673 11.6969 13.5348 12.4953 12.0467 10.5726 13.9580 7.0050 8.8266 7.3170 1.9251 2.1184 8.0049 9.1618 4.7786 4.1299 6.8701 10.5675 11.8641 9.2873 7.1023 9.4209 5.5352 8.3082 6.6435 5.3149 3.6541 1.7989 5.8602 2.9726 6.2553 6.2597 6.4698 4.9432 7.3477 2.1373 6.2920 5.5125 6.3076 2.8234 2.2744 2.5415 2.0268 2.1503 4.5537 1.0738 8.2729 2.4281 3.9364 1.8014 1.5441 3.5356 1.6993 1.8354 1.2497 3.3333 2.2199 1.0641 1.0728 8.9880 11.3074 5.4841 1.0351 1.0873 1.1018 1.1001 1.0886 1.0770 1.0781
irintensity: 0.9574 0.5216 0.6254 0.7957 0.6239 1.5716 1.0787 2.7937 0.6344 5.4321 0.6168 0.3672 3.6707 3.7611 2.5879 2.3138 2.2742 0.7610 19.2734 18.0282 14.0841 5.1016 10.4538 7.7150 40.4768 15.5606 25.9498 31.5545 64.3665 8.4558 30.3814 27.1362 12.6544 82.9896 63.9794 69.9439 32.8182 346.9333 110.2411 11.3017 62.2497 232.0459 31.3320 64.0707 50.2965 11.3570 109.0725 66.5349 118.6608 28.9121 33.0612 83.8795 1.1101 54.3487 54.0363 78.4240 129.3245 20.9095 10.3406 217.2788 134.5161 545.3441 2.5468 1.4308 2.2001 2.8757 1.0469 79.0912 68.1918
temp: 298.150 k
press: 1.00000 atm
elementType: 17 17 8 8 8 8 8 8 7 7 7 6 6 6 6 6 6 6 1 1 1 1 1 1 1
symmnumber: 1
zpe: 413482.8 jmol-1
zpe.correction: 0.157487 hartree
zpe.thermalcorrener: 0.175390 hartree
zpe.thermalcorrenthalpy: 0.176334 hartree
zpe.thermalcorrgfe: 0.107968 hartree
zpe.sumelectzpe: -1805.252224 hartree
zpe.sumelectthermal: -1805.234321 hartree
zpe.sumelectthermalent: -1805.233377 hartree
zpe.sumelectthermalfe: -1805.301743 hartree
dipole: 1.9212 -1.2222 1.3009
dipole: 2.6224
quadrupole: -137.3361 -123.4321 -122.4256
quadrupole: 0.0805 3.1213 2.2275
quadrupole: -9.6048 4.2992 5.3056 0.0805 3.1213 2.2275
hfenergy: -1805.4097108 hartree
pointgroup: C01 [X(C7H7Cl2N3O6)]
dipole: 0.6810534 -0.5103899 0.5832163 debye
dipolederiv: -0.2159265 0.0730916 -0.0479833 -0.016552 -0.5986888 0.0573817 -0.0654393 0.0247132 -0.1179551 -0.4605735 -0.2688151 0.0046912 -0.2100516 -0.3065749 0.0246796 0.0396942 0.069277 -0.070492 -2.0812876 0.2761692 0.1341321 -0.0374011 -0.3785533 0.0312212 -0.050929 0.2051911 -0.446119 -0.4130299 -0.1564353 0.2515875 -0.0892663 -0.635937 0.0990858 0.2979338 0.2844165 -0.8369325 -0.7085281 0.1886256 0.0446706 0.1438818 -0.2927732 -0.1659827 -0.1056635 -0.1525479 -0.3782163 -0.4987937 0.0334748 -0.0743003 0.1132722 -0.3756269 -0.2172909 0.034907 -0.3108417 -0.6177186 -0.4505737 0.0261046 0.0881041 0.1428797 -1.2404098 0.1162409 0.1195181 0.1376102 -0.4867739 -0.7065115 0.077261 -0.0394335 -0.0599455 -0.2664379 0.10428 0.294614 0.1291503 -0.753452 -0.8072301 0.1469962 0.0308461 0.5722206 -0.9931501 -0.1947274 0.1161332 -0.2586157 -0.5643466 1.0782963 -0.191007 0.1749726 -0.268176 0.3920635 0.4309972 0.219209 0.5063802 0.8766964 -0.4709866 -0.2252757 0.214502 -0.3936534 -1.1185352 0.5218006 0.2885812 0.3114541 -0.7161294 0.0419002 0.0340458 -0.0426398 0.0517308 0.1380653 -0.1251408 -0.0930389 -0.0835282 -0.0681665 1.3412571 -0.189388 0.1431941 -0.4102935 0.8030993 -0.0257052 0.5949741 -0.3029855 0.1477043 0.3054498 0.1913418 -0.3397498 0.3721907 1.3527026 -0.3214536 -0.3642296 -0.1598889 0.9965519 -0.0626224 -0.0253347 -0.0260341 -0.0419414 -0.0512684 -0.0025658 -0.0380034 -0.008875 -0.028784 0.8744194 -0.077475 -0.5251674 -0.2912615 1.827034 -0.0867701 -0.7924451 -0.1520229 1.1675718 1.8781477 -0.2270687 -0.1638831 -0.0129063 0.1333595 -0.2166153 -0.4713417 -0.1853677 0.9761211 0.5752471 0.294588 -0.0446751 0.3629992 1.0478949 -0.0118061 -0.111892 -0.0374006 0.1429296 0.0282432 0.0547791 0.0195077 0.0541649 0.0366646 -0.0034045 -0.0479865 -0.0139615 0.0531495 -0.0038397 -0.0518772 0.06101 -0.012604 0.0836866 0.0137611 0.0579828 0.0540926 0.0934811 0.1187464 0.0331861 0.0241856 0.0281762 0.0361636 -0.0325977 0.040695 -0.0825079 -0.0033222 0.0299997 -0.0007554 -0.0789311 0.0325734 0.1002842 -0.0024405 -0.1000967 -0.0121123 0.0671276 0.2985472 0.0076831 0.0882329 0.015616 0.146501 -0.0262093 0.0678033 -0.0367223 0.3022402 0.3098163 -0.0199139 0.0471161 -0.0337256 0.1824533 0.0398633 0.0538639 0.0756967 0.229748 -0.000167 -0.0040009 0.056045 -0.0119274 -0.022017 -0.0066015 0.0151562 -0.0006038 0.0350865 unknown
polarizability: 147.5387928|-2.2927222|145.3561965|-9.1578632|-7.193305|111.8104738 unknown
InChI: InChI=1S/C7H7Cl2N3O6/c1-7(12(16)17)4(14)10-6(15)11-5(7)18-3(13)2(8)9/h2,5,10-11H,1H3
charge 0 multiplicity 1
25 atoms
Cl 3.812689 -2.250863 0.668445
Cl 4.94198 0.585294 0.327254
O  1.106309 -0.311809 0.301586
O  -2.274216 -0.285426 2.349544
O  -3.554846 -0.369378 -0.635422
O  -2.169843 -1.608057 -1.956771
O  -0.995565 3.328823 -0.303072
O  2.47521 0.118896 -1.543525
N  -0.352957 1.180282 -0.976001
N  -2.438149 -0.928828 -0.90321
N  -1.575882 1.494897 1.02729
C  -1.263973 -0.8110 0.161846
C  -0.093287 -0.186559 -0.62942
C  -1.757928 0.132151 1.287428
C  -0.973295 -2.2228 0.681542
C  -0.968821 2.090952 -0.109756
C  2.341058 -0.158251 -0.339342
C  3.441628 -0.412876 0.691069
H  0.1301 -0.769897 -1.53755
H  -1.843455 -2.600803 1.24088
H  -0.743161 -2.899421 -0.157861
H  -0.112516 -2.189251 1.366769
H  0.132821 1.584624 -1.779937
H  -1.968355 2.155567 1.706499
H  3.110553 -0.182068 1.709816
