program: Orca
programVersion: 5.0.2
elementType: Cl O O N N N C C C C C C C C C C C C C C C C C C C C H H H H H H H H H H H H H H H H H H H H H H H H H H H H
charge: 0
multiplicity: 1
keywords: wb97x-d3
keywords: def2-TZVPP
keywords: def2/J RIJCOSX
keywords: DEFGRID2
keywords: scfconv7
keywords: smallprint printgap noloewdin
keywords: NOSOSCF
formula: C20H28ClN3O2
InChI: InChI=1/C20H28ClN3O2/c1-5-17-19(21)20(24-13-23-17)22-10-12-26-18-8-7-16(9-11-25-6-2)14(3)15(18)4/h7-8,13,22H,5-6,9-12H2,1-4H3
54 atoms
Cl 0.248245 -1.574775 1.448847
O  3.208115 2.1783 -0.11307
O  -4.404149 0.827897 0.594911
N  2.837004 -0.749228 0.166208
N  2.197794 -1.285423 -1.978826
N  0.062716 -2.188657 -2.459375
C  -0.944523 2.13633 0.186721
C  -0.148293 2.08754 1.337587
C  1.25194 2.071187 1.23134
C  -2.449162 2.142205 0.243083
C  1.842034 2.115052 -0.032881
C  -0.321402 2.156292 -1.05747
C  -3.005344 0.739015 0.427903
C  1.055832 2.15312 -1.17812
C  -0.749963 2.025815 2.711944
C  2.087566 1.980681 2.474449
C  3.87121 1.237308 -0.945677
C  4.061022 -0.104953 -0.260831
C  -5.045767 -0.41475 0.806402
C  1.904169 -1.209386 -0.679069
C  0.635228 -1.644375 -0.237533
C  -0.265228 -2.134187 -1.158053
C  -1.610967 -2.662671 -0.775222
C  -5.251597 -1.217037 -0.463403
C  -1.539948 -4.135384 -0.376363
C  1.266332 -1.763262 -2.782589
H  -2.841118 2.560909 -0.686607
H  -2.808621 2.785928 1.049134
H  -0.929032 2.193871 -1.953855
H  -2.548211 0.256434 1.303904
H  -2.738817 0.12957 -0.445314
H  1.508603 2.199512 -2.160466
H  -1.834258 2.095641 2.707259
H  -0.490436 1.089911 3.211664
H  -0.377169 2.831282 3.347364
H  1.830016 1.091188 3.054019
H  3.151669 1.934264 2.261598
H  1.923568 2.83716 3.13163
H  3.357748 1.118091 -1.90077
H  4.856492 1.654056 -1.158802
H  4.67344 0.020248 0.631389
H  4.618325 -0.756373 -0.936175
H  2.56103 -0.590275 1.122548
H  -6.015753 -0.184506 1.25252
H  -4.490272 -1.010115 1.542885
H  -2.277383 -2.547421 -1.630351
H  -2.03696 -2.082027 0.043362
H  -5.80651 -2.127532 -0.233696
H  -5.828767 -0.6532 -1.197319
H  -4.31088 -1.516608 -0.925909
H  -1.14121 -4.746815 -1.185831
H  -0.908669 -4.283371 0.499928
H  -2.535546 -4.508164 -0.136494
H  1.530575 -1.814863 -3.832942
elementType: Cl O N C H
totalener: -1554.02735157 hartree
nucrepener: 2738.03761146 hartree
electener: -4292.06496304 hartree
oneelecener: -7567.82993280 hartree
twoeener: 3275.76496976 hartree
cpcmener: -0.03222439 hartree
kineticenergy: 1548.40914297 hartree
xcener: -128.884243684780 hartree
chargesum: 0.0000000
charge: -0.101364 -0.387052 -0.405985 -0.187114 -0.401916 -0.410944 0.150456 -0.202547 -0.015290 -0.061543 0.205339 -0.265319 -0.003352 -0.144208 -0.307831 -0.268263 0.032315 -0.046978 0.063529 0.287003 -0.107554 0.264736 -0.141767 -0.262105 -0.257158 0.152177 0.087737 0.088105 0.133448 0.078527 0.086543 0.145871 0.096053 0.101921 0.113797 0.096487 0.097692 0.116129 0.094400 0.111241 0.115801 0.097616 0.183276 0.095190 0.064569 0.094296 0.060478 0.091292 0.087614 0.073799 0.095949 0.085877 0.097118 0.131906
qa: -0.1014 -0.3871 -0.4060 -0.1871 -0.4019 -0.4109 0.1505 -0.2025 -0.0153 -0.0615 0.2053 -0.2653 -0.0034 -0.1442 -0.3078 -0.2683 0.0323 -0.0470 0.0635 0.2870 -0.1076 0.2647 -0.1418 -0.2621 -0.2572 0.1522 0.0877 0.0881 0.1334 0.0785 0.0865 0.1459 0.0961 0.1019 0.1138 0.0965 0.0977 0.1161 0.0944 0.1112 0.1158 0.0976 0.1833 0.0952 0.0646 0.0943 0.0605 0.0913 0.0876 0.0738 0.0959 0.0859 0.0971 0.1319
va: 1.2350 1.9973 1.9176 3.2271 2.9622 3.0052 3.4136 3.7142 3.6777 3.7411 3.7187 3.9164 3.9544 3.8087 3.9182 3.8965 3.8181 3.8413 3.8879 4.0352 3.8644 3.7292 3.9073 3.9012 3.9318 4.1238 1.0142 1.0129 1.0057 0.9908 0.9779 0.9977 1.0057 0.9961 0.9990 0.9962 1.0245 1.0002 1.0152 1.0069 1.0003 1.0245 1.0182 0.9909 0.9990 1.0155 1.0111 1.0110 1.0102 0.9973 1.0053 1.0063 1.0045 0.9954
dispcorr: -0.034851506 hartree
energy: -1554.062203079459
dipole: -19.04509 19.78553 0.74044 0.37988 -1.15189 -0.77201 4.41284 -3.24179 1.17105
magnitude: 1.58606 au
magnitude: 4.03145 debye
