program: Orca
programVersion: 5.0.2
elementType: Cl O O N N N C C C C C C C C C C C C C C C C C C C C H H H H H H H H H H H H H H H H H H H H H H H H H H H H
charge: 0
multiplicity: 1
keywords: wb97x-d3
keywords: def2-TZVPP
keywords: def2/J RIJCOSX
keywords: DEFGRID2
keywords: scfconv7
keywords: smallprint printgap noloewdin
keywords: NOSOSCF
formula: C20H28ClN3O2
InChI: InChI=1/C20H28ClN3O2/c1-5-17-19(21)20(24-13-23-17)22-10-12-26-18-8-7-16(9-11-25-6-2)14(3)15(18)4/h7-8,13,22H,5-6,9-12H2,1-4H3
54 atoms
Cl 0.578596 -1.184454 -2.328157
O  2.806204 2.200135 0.476316
O  -4.787327 1.059653 1.582797
N  3.127566 -0.332026 -0.989869
N  2.849101 -1.668008 0.866906
N  0.863096 -2.906715 1.223418
C  -1.115573 0.829799 0.791385
C  -0.689624 1.50597 -0.358463
C  0.64054 1.944913 -0.470608
C  -2.525345 0.331946 0.965236
C  1.523004 1.730112 0.589415
C  -0.211475 0.646263 1.833676
C  -3.439312 1.459911 1.443048
C  1.092308 1.096623 1.748972
C  -1.615494 1.75872 -1.514833
C  1.096321 2.615535 -1.733751
C  3.869329 1.302455 0.766762
C  4.229441 0.411754 -0.413845
C  -5.525708 1.058731 0.372698
C  2.384333 -1.209681 -0.296149
C  1.138638 -1.674744 -0.76666
C  0.382539 -2.498389 0.038345
C  -0.973462 -2.993631 -0.355781
C  -5.990558 2.440481 -0.043313
C  -0.889936 -4.247939 -1.223308
C  2.067084 -2.482672 1.549941
H  -2.535548 -0.471075 1.705894
H  -2.905089 -0.101017 0.036835
H  -0.53674 0.137924 2.733844
H  -3.346569 2.324854 0.774936
H  -3.1049 1.793244 2.428826
H  1.764141 0.950847 2.584969
H  -1.284128 1.226108 -2.409035
H  -2.639828 1.45135 -1.319546
H  -1.642921 2.818036 -1.776568
H  0.568418 3.557157 -1.90043
H  2.159881 2.837104 -1.729066
H  0.896176 1.989238 -2.605497
H  4.739588 1.917384 1.000308
H  3.654083 0.703794 1.652029
H  5.023446 -0.2642 -0.092547
H  4.641386 1.015071 -1.220985
H  2.687319 0.099853 -1.786984
H  -6.391983 0.416544 0.544555
H  -4.951234 0.599167 -0.440329
H  -1.526156 -2.215161 -0.884021
H  -1.527231 -3.217299 0.556187
H  -6.603706 2.364357 -0.942265
H  -6.596325 2.906779 0.734691
H  -5.157551 3.105834 -0.274392
H  -0.370054 -4.055128 -2.161517
H  -0.365088 -5.051453 -0.706653
H  -1.890117 -4.605975 -1.465926
H  2.465698 -2.841515 2.492315
elementType: Cl O N C H
totalener: -1554.02476723 hartree
nucrepener: 2732.30705216 hartree
electener: -4286.33181939 hartree
oneelecener: -7556.56161852 hartree
twoeener: 3270.22979913 hartree
cpcmener: -0.03271705 hartree
kineticenergy: 1548.40571422 hartree
xcener: -128.886579432377 hartree
chargesum: 0.0000000
charge: -0.099968 -0.386878 -0.418268 -0.193721 -0.391768 -0.394907 0.087403 -0.149450 -0.044649 -0.120216 0.265392 -0.208254 0.004362 -0.191521 -0.292627 -0.278086 0.027967 -0.047507 0.056103 0.248465 -0.053407 0.211698 -0.125683 -0.262171 -0.259273 0.154905 0.086085 0.093902 0.132615 0.095291 0.106646 0.142619 0.099115 0.089523 0.116015 0.116816 0.097972 0.094085 0.111206 0.098377 0.096974 0.114094 0.180481 0.098263 0.072550 0.073349 0.086112 0.089334 0.081526 0.083394 0.084325 0.093326 0.096992 0.131070
qa: -0.1000 -0.3869 -0.4183 -0.1937 -0.3918 -0.3949 0.0874 -0.1494 -0.0446 -0.1202 0.2654 -0.2083 0.0044 -0.1915 -0.2926 -0.2781 0.0280 -0.0475 0.0561 0.2485 -0.0534 0.2117 -0.1257 -0.2622 -0.2593 0.1549 0.0861 0.0939 0.1326 0.0953 0.1066 0.1426 0.0991 0.0895 0.1160 0.1168 0.0980 0.0941 0.1112 0.0984 0.0970 0.1141 0.1805 0.0983 0.0726 0.0733 0.0861 0.0893 0.0815 0.0834 0.0843 0.0933 0.0970 0.1311
va: 1.2422 2.0012 1.9039 3.2171 2.9728 3.0010 3.3622 3.6562 3.7063 3.7065 3.6271 3.8683 3.9142 3.8429 3.9283 3.9016 3.8181 3.8517 3.8829 4.1314 3.9092 3.7765 3.8830 3.9081 3.9306 4.1131 1.0204 1.0017 1.0073 0.9867 1.0082 0.9997 1.0035 1.0023 0.9942 0.9997 1.0242 0.9978 1.0065 1.0132 1.0204 0.9999 1.0206 0.9935 0.9900 1.0119 1.0222 1.0098 1.0087 0.9994 1.0075 1.0050 1.0041 0.9977
dispcorr: -0.035580382 hartree
energy: -1554.060347609174
dipole: -24.33953 24.82954 0.49001 10.47124 -9.82818 0.64306 -0.79584 -1.00580 -1.80164
magnitude: 1.97473 au
magnitude: 5.01936 debye
