program: Orca
programVersion: 5.0.2
elementType: Cl O O N N N C C C C C C C C C C C C C C C C C C C C H H H H H H H H H H H H H H H H H H H H H H H H H H H H
charge: 0
multiplicity: 1
keywords: wb97x-d3
keywords: def2-TZVPP
keywords: def2/J RIJCOSX
keywords: DEFGRID2
keywords: scfconv7
keywords: smallprint printgap noloewdin
keywords: NOSOSCF
formula: C20H28ClN3O2
InChI: InChI=1/C20H28ClN3O2/c1-5-17-19(21)20(24-13-23-17)22-10-12-26-18-8-7-16(9-11-25-6-2)14(3)15(18)4/h7-8,13,22H,5-6,9-12H2,1-4H3
54 atoms
Cl 2.62215 -2.68219 1.108935
O  3.013423 1.827717 0.410331
O  -4.588854 1.283245 -0.776325
N  3.026375 -0.611124 -1.02594
N  0.830015 -0.611813 -1.73661
N  -0.809569 -1.997617 -0.742884
C  -1.110794 2.226626 0.153756
C  -0.522845 1.514659 1.210538
C  0.871113 1.386273 1.287554
C  -2.604493 2.358321 0.016369
C  1.662775 1.972004 0.290946
C  -0.291707 2.804626 -0.806646
C  -3.183701 1.178998 -0.750565
C  1.08637 2.687857 -0.747175
C  -1.394075 0.919991 2.283629
C  1.511116 0.643964 2.428179
C  3.811563 1.712678 -0.754552
C  3.359859 0.615941 -1.711955
C  -5.201749 0.199696 -1.444683
C  1.769902 -1.073984 -0.910304
C  1.417461 -2.068245 0.027377
C  0.115154 -2.51736 0.078813
C  -0.35136 -3.55492 1.050001
C  -6.702451 0.355316 -1.378422
C  -0.788671 -2.931969 2.373352
C  -0.394207 -1.075377 -1.588437
H  -2.839691 3.281816 -0.517673
H  -3.08412 2.429355 0.994798
H  -0.739136 3.364503 -1.619522
H  -2.879463 0.233441 -0.281096
H  -2.775814 1.169656 -1.771032
H  1.696706 3.155346 -1.509025
H  -1.702965 1.683261 3.002357
H  -2.304199 0.479269 1.879238
H  -0.889709 0.140254 2.847919
H  1.328251 1.149239 3.378404
H  1.111138 -0.365224 2.528658
H  2.586619 0.551057 2.313674
H  3.878172 2.657291 -1.304173
H  4.810846 1.490914 -0.378725
H  4.17565 0.446567 -2.417865
H  2.499971 0.925991 -2.297684
H  3.705241 -0.943693 -0.358005
H  -4.901457 -0.750179 -0.98226
H  -4.870528 0.159168 -2.490934
H  0.428184 -4.295042 1.230096
H  -1.194052 -4.080264 0.600955
H  -7.181793 -0.479177 -1.889722
H  -7.057313 0.361069 -0.347098
H  -7.032519 1.275373 -1.861754
H  -1.1490 -3.703561 3.053238
H  0.034538 -2.414024 2.865655
H  -1.596565 -2.216002 2.224187
H  -1.139912 -0.663474 -2.259031
elementType: Cl O N C H
totalener: -1554.02769547 hartree
nucrepener: 2716.49364627 hartree
electener: -4270.52134174 hartree
oneelecener: -7525.70761193 hartree
twoeener: 3255.18627020 hartree
cpcmener: -0.03309061 hartree
kineticenergy: 1548.42201906 hartree
xcener: -128.889101813242 hartree
chargesum: 0.0000000
charge: -0.096108 -0.373246 -0.398485 -0.171549 -0.375615 -0.398066 0.049802 -0.160221 0.069191 -0.062912 0.244419 -0.220303 0.014318 -0.201274 -0.357919 -0.284673 0.015293 -0.056422 0.065220 0.262386 -0.126773 0.233043 -0.097856 -0.253483 -0.293664 0.141587 0.088453 0.088143 0.136601 0.055527 0.088259 0.148728 0.126027 0.114460 0.100972 0.126884 0.075060 0.099282 0.099257 0.114950 0.117029 0.118062 0.159524 0.070503 0.071202 0.079508 0.079826 0.084685 0.082296 0.083095 0.108214 0.091034 0.092655 0.133074
qa: -0.0961 -0.3732 -0.3985 -0.1715 -0.3756 -0.3981 0.0498 -0.1602 0.0692 -0.0629 0.2444 -0.2203 0.0143 -0.2013 -0.3579 -0.2847 0.0153 -0.0564 0.0652 0.2624 -0.1268 0.2330 -0.0979 -0.2535 -0.2937 0.1416 0.0885 0.0881 0.1366 0.0555 0.0883 0.1487 0.1260 0.1145 0.1010 0.1269 0.0751 0.0993 0.0993 0.1149 0.1170 0.1181 0.1595 0.0705 0.0712 0.0795 0.0798 0.0847 0.0823 0.0831 0.1082 0.0910 0.0927 0.1331
va: 1.2436 2.0254 1.9282 3.2362 2.9696 2.9749 3.5481 3.6708 3.5366 3.7395 3.6935 3.9741 3.9433 3.8420 3.9429 3.9059 3.8800 3.8022 3.8649 4.1124 3.8533 3.7632 3.8732 3.9568 3.9403 4.0968 1.0138 1.0132 1.0031 1.0040 0.9963 0.9979 0.9939 0.9818 0.9963 0.9971 0.9954 1.0272 0.9982 0.9933 1.0092 1.0313 1.0363 0.9895 0.9882 1.0153 1.0241 1.0078 1.0046 1.0046 1.0090 0.9964 0.9996 1.0008
dispcorr: -0.034702893 hartree
energy: -1554.062398361048
dipole: -28.91934 30.48705 1.56772 8.16154 -8.58491 -0.42337 2.67968 -2.92617 -0.24650
magnitude: 1.64248 au
magnitude: 4.17486 debye
