program: Orca
programVersion: 5.0.2
elementType: Cl O O N N N C C C C C C C C C C C C C C C C C C C C H H H H H H H H H H H H H H H H H H H H H H H H H H H H
charge: 0
multiplicity: 1
keywords: wb97x-d3
keywords: def2-TZVPP
keywords: def2/J RIJCOSX
keywords: DEFGRID2
keywords: scfconv7
keywords: smallprint printgap noloewdin
keywords: NOSOSCF
formula: C20H28ClN3O2
InChI: InChI=1/C20H28ClN3O2/c1-5-17-19(21)20(24-13-23-17)22-10-12-26-18-8-7-16(9-11-25-6-2)14(3)15(18)4/h7-8,13,22H,5-6,9-12H2,1-4H3
54 atoms
Cl 1.351654 -2.136574 2.028813
O  1.955212 1.965959 -0.912079
O  -3.694994 2.337703 1.612199
N  3.200256 -0.392259 0.436861
N  2.533494 -1.197822 -1.622364
N  0.831017 -2.82905 -1.835289
C  -1.689441 0.48257 0.452149
C  -1.387864 0.529401 -0.916144
C  -0.14593 1.012161 -1.355235
C  -3.038722 0.077477 0.979364
C  0.793957 1.454122 -0.414951
C  -0.722209 0.903529 1.356122
C  -4.075499 1.191514 0.876513
C  0.507055 1.385418 0.942709
C  -2.373614 0.070064 -1.953789
C  0.145739 1.068488 -2.828343
C  3.12663 2.035188 -0.116775
C  3.917417 0.736758 -0.115659
C  -3.206845 3.412675 0.830692
C  2.411883 -1.19954 -0.294384
C  1.487241 -2.08303 0.30324
C  0.709437 -2.889739 -0.499506
C  -0.308889 -3.840898 0.047718
C  -2.765042 4.524393 1.752957
C  -1.633451 -3.147158 0.357885
C  1.735672 -1.993868 -2.30621
H  -2.941521 -0.212997 2.028504
H  -3.435826 -0.799428 0.463298
H  -0.930499 0.854364 2.418203
H  -5.024292 0.830436 1.284815
H  -4.260072 1.444737 -0.173911
H  1.221314 1.697086 1.692194
H  -1.963999 -0.745574 -2.553963
H  -3.306617 -0.28547 -1.525686
H  -2.622902 0.873124 -2.650741
H  -0.041649 0.105957 -3.307414
H  -0.498287 1.794731 -3.33068
H  1.173638 1.341913 -3.046851
H  3.749004 2.808718 -0.568927
H  2.912816 2.362229 0.902827
H  4.815577 0.900308 0.481191
H  4.246242 0.492438 -1.122899
H  2.985366 -0.324628 1.420263
H  -3.990514 3.774528 0.152009
H  -2.36477 3.096579 0.203918
H  0.06943 -4.329841 0.94677
H  -0.472433 -4.62057 -0.696328
H  -3.584941 4.873391 2.384175
H  -1.944637 4.203671 2.398677
H  -2.414056 5.372613 1.164629
H  -2.369715 -3.876912 0.69458
H  -1.523719 -2.400438 1.143818
H  -2.036524 -2.651172 -0.526125
H  1.846484 -1.962856 -3.384555
elementType: Cl O N C H
totalener: -1554.02603449 hartree
nucrepener: 2769.30429074 hartree
electener: -4323.33032523 hartree
oneelecener: -7631.63299021 hartree
twoeener: 3308.30266499 hartree
cpcmener: -0.03485270 hartree
kineticenergy: 1548.40347820 hartree
xcener: -128.888522359888 hartree
chargesum: -0.0000000
charge: -0.098475 -0.362375 -0.416666 -0.192006 -0.388334 -0.395544 0.159865 -0.193980 0.042735 -0.122512 0.285541 -0.289152 0.001190 -0.185414 -0.339825 -0.299922 0.004121 -0.006509 0.055961 0.281698 -0.128050 0.237793 -0.105822 -0.256951 -0.278129 0.138779 0.094922 0.080598 0.126785 0.093908 0.087784 0.140371 0.105263 0.099004 0.121520 0.100735 0.119740 0.097891 0.112646 0.101504 0.108012 0.097041 0.168776 0.088980 0.074463 0.084276 0.079268 0.085444 0.081901 0.086055 0.106813 0.078004 0.092833 0.137444
qa: -0.0985 -0.3624 -0.4167 -0.1920 -0.3883 -0.3955 0.1599 -0.1940 0.0427 -0.1225 0.2855 -0.2892 0.0012 -0.1854 -0.3398 -0.2999 0.0041 -0.0065 0.0560 0.2817 -0.1280 0.2378 -0.1058 -0.2570 -0.2781 0.1388 0.0949 0.0806 0.1268 0.0939 0.0878 0.1404 0.1053 0.0990 0.1215 0.1007 0.1197 0.0979 0.1126 0.1015 0.1080 0.0970 0.1688 0.0890 0.0745 0.0843 0.0793 0.0854 0.0819 0.0861 0.1068 0.0780 0.0928 0.1374
va: 1.2361 2.0341 1.8779 3.2442 2.9635 2.9919 3.1618 3.5716 3.5723 3.7872 3.5887 3.9437 3.9699 3.8085 3.9166 3.9014 3.8885 3.8265 3.8560 4.0978 3.8872 3.7613 3.8860 3.9467 3.9481 4.1004 1.0040 1.0136 1.0108 1.0048 0.9905 1.0078 1.0020 1.0046 0.9959 0.9903 0.9976 1.0264 1.0022 0.9957 1.0088 1.0317 1.0300 0.9930 0.9781 1.0126 1.0260 1.0058 1.0043 1.0076 1.0080 1.0027 0.9917 0.9965
dispcorr: -0.036854244 hartree
energy: -1554.062888729211
dipole: -23.82917 24.41586 0.58669 17.23242 -16.58070 0.65172 -5.83254 6.46199 0.62945
magnitude: 1.07942 au
magnitude: 2.74367 debye
