program: Orca
programVersion: 5.0.2
elementType: Cl O O N N N C C C C C C C C C C C C C C C C C C C C H H H H H H H H H H H H H H H H H H H H H H H H H H H H
charge: 0
multiplicity: 1
keywords: wb97x-d3
keywords: def2-TZVPP
keywords: def2/J RIJCOSX
keywords: DEFGRID2
keywords: scfconv7
keywords: smallprint printgap noloewdin
keywords: NOSOSCF
formula: C20H28ClN3O2
InChI: InChI=1/C20H28ClN3O2/c1-5-17-19(21)20(24-13-23-17)22-10-12-26-18-8-7-16(9-11-25-6-2)14(3)15(18)4/h7-8,13,22H,5-6,9-12H2,1-4H3
54 atoms
Cl -0.176946 -1.562282 1.238746
O  2.994154 1.756856 -0.035258
O  -2.989099 0.451235 1.954078
N  2.730284 -1.045554 0.755175
N  2.65138 -1.49018 -1.512813
N  0.624199 -2.04473 -2.605387
C  -1.117763 2.242922 0.470924
C  -0.563878 2.013446 -0.795589
C  0.822521 1.849018 -0.950279
C  -2.595463 2.437889 0.691395
C  1.65033 1.881987 0.177374
C  -0.262347 2.283078 1.565963
C  -3.383798 1.140921 0.788792
C  1.103109 2.10482 1.435933
C  -1.421593 1.921049 -2.026298
C  1.391592 1.668817 -2.328906
C  3.830761 1.153609 0.938369
C  3.99118 -0.339276 0.704499
C  -3.519984 -0.853131 2.06607
C  2.024234 -1.378455 -0.340995
C  0.641333 -1.649637 -0.281613
C  -0.038915 -1.949156 -1.442187
C  -1.517486 -2.180417 -1.47141
C  -5.00711 -0.891435 2.364833
C  -1.900165 -3.5894 -1.024082
C  1.921797 -1.816509 -2.56227
H  -3.038537 3.038085 -0.105145
H  -2.751875 3.007667 1.611115
H  -0.670012 2.474201 2.551458
H  -3.208521 0.519477 -0.101261
H  -4.455187 1.375848 0.807633
H  1.722242 2.162145 2.320725
H  -1.108767 2.638612 -2.787616
H  -1.345901 0.93107 -2.483602
H  -2.474686 2.099944 -1.827709
H  1.244379 2.569969 -2.929626
H  2.455914 1.455606 -2.324366
H  0.896275 0.858952 -2.865711
H  4.80953 1.627408 0.848344
H  3.482165 1.339458 1.955605
H  4.657054 -0.728151 1.477011
H  4.46721 -0.530342 -0.253515
H  2.198582 -0.903463 1.601503
H  -2.97377 -1.331967 2.881318
H  -3.310672 -1.431863 1.156441
H  -1.861535 -2.017984 -2.492739
H  -2.023191 -1.442733 -0.844538
H  -5.60994 -0.51035 1.539905
H  -5.314076 -1.923052 2.541832
H  -5.247992 -0.315963 3.259874
H  -2.979728 -3.723361 -1.087172
H  -1.433966 -4.343653 -1.658234
H  -1.602277 -3.785113 0.005456
H  2.457297 -1.903832 -3.501098
elementType: Cl O N C H
totalener: -1554.02598624 hartree
nucrepener: 2783.86988913 hartree
electener: -4337.89587538 hartree
oneelecener: -7660.73970810 hartree
twoeener: 3322.84383272 hartree
cpcmener: -0.03503746 hartree
kineticenergy: 1548.39782648 hartree
xcener: -128.885123051919 hartree
chargesum: 0.0000000
charge: -0.098338 -0.371003 -0.391318 -0.183600 -0.393211 -0.401084 0.181793 -0.203791 0.042128 -0.112724 0.196849 -0.240493 -0.031717 -0.187354 -0.312797 -0.311171 0.013813 -0.014960 0.070495 0.256243 -0.040054 0.184031 -0.096368 -0.273029 -0.271933 0.151957 0.100392 0.089235 0.134367 0.088861 0.104251 0.144614 0.114290 0.104606 0.095520 0.124542 0.096032 0.097500 0.106066 0.103259 0.103230 0.102436 0.164331 0.092515 0.045287 0.087233 0.055047 0.087444 0.092814 0.085800 0.099588 0.101065 0.084265 0.133044
qa: -0.0983 -0.3710 -0.3913 -0.1836 -0.3932 -0.4011 0.1818 -0.2038 0.0421 -0.1127 0.1968 -0.2405 -0.0317 -0.1874 -0.3128 -0.3112 0.0138 -0.0150 0.0705 0.2562 -0.0401 0.1840 -0.0964 -0.2730 -0.2719 0.1520 0.1004 0.0892 0.1344 0.0889 0.1043 0.1446 0.1143 0.1046 0.0955 0.1245 0.0960 0.0975 0.1061 0.1033 0.1032 0.1024 0.1643 0.0925 0.0453 0.0872 0.0550 0.0874 0.0928 0.0858 0.0996 0.1011 0.0843 0.1330
va: 1.2517 2.0170 1.8929 3.2331 2.9811 2.9890 3.2993 3.7524 3.5522 3.8152 3.7568 3.9863 3.9469 3.8644 3.9229 3.8998 3.8807 3.8181 3.8945 4.1033 3.8413 3.7835 3.9059 3.9440 3.9280 4.0982 1.0019 1.0142 1.0082 0.9671 0.9980 1.0012 0.9984 0.9923 1.0090 0.9981 1.0265 0.9972 1.0069 0.9980 1.0101 1.0343 1.0372 0.9858 0.9923 1.0307 0.9889 0.9987 1.0086 1.0071 1.0027 1.0051 1.0095 0.9983
dispcorr: -0.036174449 hartree
energy: -1554.062160692602
dipole: -21.80620 21.37007 -0.43612 3.91925 -3.97224 -0.05298 -2.48155 3.57177 1.09023
magnitude: 1.17542 au
magnitude: 2.98767 debye
