program: Orca
programVersion: 5.0.2
elementType: Cl O O N N N C C C C C C C C C C C C C C C C C C C C H H H H H H H H H H H H H H H H H H H H H H H H H H H H
charge: 0
multiplicity: 1
keywords: wb97x-d3
keywords: def2-TZVPP
keywords: def2/J RIJCOSX
keywords: DEFGRID2
keywords: scfconv7
keywords: smallprint printgap noloewdin
keywords: NOSOSCF
formula: C20H28ClN3O2
InChI: InChI=1/C20H28ClN3O2/c1-5-17-19(21)20(24-13-23-17)22-10-12-26-18-8-7-16(9-11-25-6-2)14(3)15(18)4/h7-8,13,22H,5-6,9-12H2,1-4H3
54 atoms
Cl 0.511042 -1.671992 1.658024
O  3.125374 2.232527 -0.284865
O  -4.266757 0.291872 0.839019
N  2.862434 -0.695183 0.063536
N  1.945767 -1.172879 -1.992791
N  -0.205559 -2.139473 -2.208365
C  -0.995502 2.058051 0.291858
C  -0.123348 2.025777 1.386998
C  1.266677 2.059837 1.187812
C  -2.488703 1.949026 0.442242
C  1.769307 2.1386 -0.111558
C  -0.457552 2.122619 -0.990429
C  -2.884136 0.485461 0.626819
C  0.907487 2.171815 -1.201254
C  -0.629143 1.924283 2.797416
C  2.184994 1.976194 2.371356
C  3.741992 1.303372 -1.165465
C  4.020012 -0.032442 -0.497828
C  -5.074501 0.37827 -0.321816
C  1.836154 -1.158519 -0.662459
C  0.658313 -1.663116 -0.067372
C  -0.341301 -2.164469 -0.8722
C  -1.579106 -2.805087 -0.327443
C  -4.930205 -0.808871 -1.254593
C  -1.344356 -4.281786 -0.013595
C  0.921914 -1.646328 -2.677906
H  -2.96558 2.352293 -0.453853
H  -2.855914 2.540305 1.283683
H  -1.124214 2.146173 -1.844405
H  -2.380018 0.077165 1.506771
H  -2.523057 -0.088232 -0.234665
H  1.292003 2.248898 -2.210332
H  -1.712306 1.976455 2.866913
H  -0.320438 0.983369 3.257921
H  -0.226573 2.723241 3.422513
H  2.051417 2.825847 3.044216
H  1.980936 1.079181 2.960234
H  3.233025 1.949247 2.087151
H  3.156214 1.167291 -2.07505
H  4.697418 1.740615 -1.458514
H  4.722965 0.104798 0.322827
H  4.511891 -0.678345 -1.227847
H  2.718352 -0.579503 1.05385
H  -4.883428 1.307396 -0.871165
H  -6.10375 0.434973 0.037764
H  -2.368823 -2.711505 -1.073074
H  -1.922726 -2.29119 0.570187
H  -5.650788 -0.717495 -2.06845
H  -3.939706 -0.870209 -1.706532
H  -5.1300 -1.747691 -0.736301
H  -1.022544 -4.829747 -0.899156
H  -0.585454 -4.412965 0.757867
H  -2.265381 -4.740636 0.34534
H  1.03003 -1.633356 -3.756784
elementType: Cl O N C H
totalener: -1554.02543617 hartree
nucrepener: 2754.43376380 hartree
electener: -4308.45919997 hartree
oneelecener: -7600.86617055 hartree
twoeener: 3292.40697059 hartree
cpcmener: -0.03185418 hartree
kineticenergy: 1548.41296535 hartree
xcener: -128.887243603501 hartree
chargesum: -0.0000000
charge: -0.100028 -0.387984 -0.417865 -0.185362 -0.401003 -0.412057 0.129005 -0.191217 -0.023371 -0.076592 0.238448 -0.250988 0.015401 -0.168850 -0.308175 -0.273653 0.033656 -0.053214 0.063974 0.291660 -0.121566 0.275130 -0.152490 -0.272679 -0.259896 0.149330 0.089437 0.089801 0.134200 0.101505 0.071090 0.145615 0.096730 0.101002 0.113399 0.116795 0.095286 0.098087 0.094588 0.110901 0.115541 0.099619 0.182832 0.068782 0.094835 0.088666 0.080761 0.097086 0.080422 0.083739 0.094904 0.085799 0.097175 0.131790
qa: -0.1000 -0.3880 -0.4179 -0.1854 -0.4010 -0.4121 0.1290 -0.1912 -0.0234 -0.0766 0.2384 -0.2510 0.0154 -0.1688 -0.3082 -0.2737 0.0337 -0.0532 0.0640 0.2917 -0.1216 0.2751 -0.1525 -0.2727 -0.2599 0.1493 0.0894 0.0898 0.1342 0.1015 0.0711 0.1456 0.0967 0.1010 0.1134 0.1168 0.0953 0.0981 0.0946 0.1109 0.1155 0.0996 0.1828 0.0688 0.0948 0.0887 0.0808 0.0971 0.0804 0.0837 0.0949 0.0858 0.0972 0.1318
va: 1.2397 1.9970 1.9128 3.2264 2.9602 2.9804 3.4403 3.7346 3.6939 3.7433 3.6694 3.9037 3.9641 3.8324 3.9179 3.8993 3.8159 3.8446 3.8933 4.0328 3.8856 3.6704 3.9071 3.8941 3.9443 4.1272 1.0084 1.0113 1.0053 1.0008 0.9830 0.9982 1.0074 0.9976 0.9987 1.0005 0.9965 1.0242 1.0161 1.0067 1.0001 1.0220 1.0185 0.9918 0.9902 1.0170 1.0102 1.0120 0.9976 1.0072 1.0046 1.0067 1.0044 0.9954
dispcorr: -0.035655028 hartree
energy: -1554.061091195477
dipole: -18.31704 19.13930 0.82226 2.73947 -2.78745 -0.04797 0.48890 -0.12512 0.36378
magnitude: 0.90041 au
magnitude: 2.28867 debye
