program: Orca
programVersion: 5.0.2
elementType: Cl O O N N N C C C C C C C C C C C C C C C C C C C C H H H H H H H H H H H H H H H H H H H H H H H H H H H H
charge: 0
multiplicity: 1
keywords: wb97x-d3
keywords: def2-TZVPP
keywords: def2/J RIJCOSX
keywords: DEFGRID2
keywords: scfconv7
keywords: smallprint printgap noloewdin
keywords: NOSOSCF
formula: C20H28ClN3O2
InChI: InChI=1/C20H28ClN3O2/c1-5-17-19(21)20(24-13-23-17)22-10-12-26-18-8-7-16(9-11-25-6-2)14(3)15(18)4/h7-8,13,22H,5-6,9-12H2,1-4H3
54 atoms
Cl 2.96988 -2.817145 -0.576588
O  2.832943 1.554506 -0.859373
O  -4.614498 1.501675 1.180031
N  3.230774 -0.39738 1.189827
N  0.996121 -0.342762 1.784643
N  -0.571734 -1.88073 0.903234
C  -1.244074 2.191806 -0.356203
C  -0.769178 1.235804 -1.267161
C  0.609415 1.025476 -1.419493
C  -2.710451 2.406842 -0.090943
C  1.505422 1.793328 -0.666882
C  -0.32158 2.941032 0.364865
C  -3.25642 1.325846 0.841412
C  1.041542 2.760952 0.213139
C  -1.712577 0.404453 -2.091016
C  1.114074 -0.007684 -2.386757
C  3.752129 1.798699 0.191665
C  3.468692 1.003906 1.461912
C  -5.523666 1.128418 0.161834
C  1.985712 -0.910173 1.090994
C  1.700831 -2.046106 0.312534
C  0.397097 -2.494352 0.215884
C  0.033232 -3.652014 -0.665322
C  -6.929073 1.202863 0.711228
C  -1.454663 -3.924118 -0.785883
C  -0.210988 -0.849088 1.644589
H  -3.280236 2.433418 -1.022486
H  -2.849694 3.380102 0.385231
H  -0.676566 3.689894 1.063056
H  -2.697742 1.355603 1.780569
H  -3.096296 0.331045 0.403503
H  1.724708 3.372884 0.787559
H  -1.682976 -0.647038 -1.793488
H  -2.746236 0.731014 -2.006533
H  -1.449662 0.437147 -3.149501
H  0.498821 -0.907337 -2.37257
H  1.097257 0.368251 -3.413575
H  2.135478 -0.312812 -2.174337
H  4.718892 1.503376 -0.217836
H  3.821627 2.862558 0.440498
H  2.619225 1.402959 2.008359
H  4.338822 1.113001 2.111196
H  3.933001 -0.836482 0.612567
H  -5.305918 0.108919 -0.183218
H  -5.432203 1.784718 -0.71184
H  0.546414 -4.544224 -0.293665
H  0.453784 -3.474311 -1.659096
H  -7.64298 0.923115 -0.063197
H  -7.06633 0.522793 1.552802
H  -7.176304 2.212591 1.041305
H  -1.990935 -3.067326 -1.194171
H  -1.614971 -4.765143 -1.460299
H  -1.906893 -4.177689 0.171583
H  -0.99701 -0.367358 2.215819
elementType: Cl O N C H
totalener: -1554.02632195 hartree
nucrepener: 2703.64499151 hartree
electener: -4257.67131346 hartree
oneelecener: -7499.92906605 hartree
twoeener: 3242.25775258 hartree
cpcmener: -0.03439509 hartree
kineticenergy: 1548.39491060 hartree
xcener: -128.884979544565 hartree
chargesum: 0.0000000
charge: -0.095835 -0.369709 -0.409360 -0.183466 -0.368926 -0.397453 0.058718 -0.159201 0.025001 -0.095092 0.261499 -0.194804 0.001228 -0.213745 -0.295341 -0.314743 0.005763 -0.044257 0.067491 0.231801 -0.086420 0.195260 -0.091578 -0.256268 -0.263367 0.132048 0.100380 0.082617 0.133662 0.104807 0.081634 0.146434 0.094847 0.097357 0.116774 0.102169 0.126458 0.086008 0.116933 0.100134 0.116260 0.114167 0.157810 0.075195 0.073210 0.104346 0.083310 0.084334 0.082658 0.083336 0.084526 0.096534 0.079686 0.135169
qa: -0.0958 -0.3697 -0.4094 -0.1835 -0.3689 -0.3975 0.0587 -0.1592 0.0250 -0.0951 0.2615 -0.1948 0.0012 -0.2137 -0.2953 -0.3147 0.0058 -0.0443 0.0675 0.2318 -0.0864 0.1953 -0.0916 -0.2563 -0.2634 0.1320 0.1004 0.0826 0.1337 0.1048 0.0816 0.1464 0.0948 0.0974 0.1168 0.1022 0.1265 0.0860 0.1169 0.1001 0.1163 0.1142 0.1578 0.0752 0.0732 0.1043 0.0833 0.0843 0.0827 0.0833 0.0845 0.0965 0.0797 0.1352
va: 1.2548 2.0358 1.9249 3.2069 2.9728 2.9282 3.5079 3.6937 3.5735 3.7013 3.7036 3.9846 3.9399 3.8432 3.9365 3.9481 3.8938 3.8112 3.8660 4.1689 3.9528 3.7867 3.8767 3.9545 3.9487 4.0946 1.0018 1.0207 1.0050 1.0061 1.0060 0.9996 0.9925 1.0053 0.9969 0.9849 0.9968 1.0247 0.9931 0.9999 1.0284 1.0108 1.0369 0.9891 0.9814 1.0021 1.0031 1.0074 1.0057 1.0044 1.0010 1.0056 1.0103 1.0001
dispcorr: -0.034605067 hartree
energy: -1554.060927020174
dipole: -33.33434 34.69917 1.36483 8.51999 -8.57520 -0.05521 -6.00210 5.16726 -0.83484
magnitude: 1.60086 au
magnitude: 4.06906 debye
