program: Orca
programVersion: 5.0.2
elementType: Cl O O N N N C C C C C C C C C C C C C C C C C C C C H H H H H H H H H H H H H H H H H H H H H H H H H H H H
charge: 0
multiplicity: 1
keywords: wb97x-d3
keywords: def2-TZVPP
keywords: def2/J RIJCOSX
keywords: DEFGRID2
keywords: scfconv7
keywords: smallprint printgap noloewdin
keywords: NOSOSCF
formula: C20H28ClN3O2
InChI: InChI=1/C20H28ClN3O2/c1-5-17-19(21)20(24-13-23-17)22-10-12-26-18-8-7-16(9-11-25-6-2)14(3)15(18)4/h7-8,13,22H,5-6,9-12H2,1-4H3
54 atoms
Cl 0.309661 -1.716742 1.544627
O  2.999724 1.939139 -0.29657
O  -4.454318 0.277365 1.126972
N  3.061833 -0.781173 0.783996
N  2.869476 -1.365634 -1.443754
N  0.879434 -2.299019 -2.323386
C  -1.099881 1.864787 0.454745
C  -0.596883 1.683085 -0.840671
C  0.787348 1.70893 -1.078151
C  -2.56988 1.827254 0.779158
C  1.666697 1.889701 -0.004205
C  -0.196365 2.053091 1.493688
C  -3.065404 0.38863 0.908426
C  1.169474 2.065286 1.282344
C  -1.51019 1.440004 -2.009308
C  1.296872 1.563856 -2.483979
C  3.962107 1.522646 0.658592
C  4.241453 0.029803 0.584498
C  -4.878074 0.647555 2.42496
C  2.328953 -1.28366 -0.225698
C  1.016912 -1.761422 -0.03397
C  0.306492 -2.246411 -1.113874
C  -1.11008 -2.71775 -0.968331
C  -6.332698 0.273216 2.588591
C  -1.813248 -3.059756 -2.269014
C  2.120808 -1.861667 -2.407742
H  -3.162164 2.347387 0.02268
H  -2.732307 2.35994 1.718793
H  -0.569783 2.198424 2.500639
H  -2.50677 -0.117929 1.707565
H  -2.861509 -0.152681 -0.019142
H  1.824931 2.225485 2.126961
H  -1.311208 2.133849 -2.827717
H  -1.372473 0.433505 -2.413527
H  -2.561428 1.53908 -1.752004
H  0.864694 0.693482 -2.978837
H  1.021733 2.431489 -3.089137
H  2.376524 1.46586 -2.535049
H  4.882987 2.057471 0.421187
H  3.685785 1.809573 1.674697
H  4.976363 -0.208351 1.355596
H  4.68713 -0.228579 -0.371982
H  2.587946 -0.652857 1.665557
H  -4.752484 1.724127 2.591087
H  -4.268722 0.13626 3.182042
H  -1.676994 -1.946533 -0.440258
H  -1.119003 -3.585088 -0.300772
H  -6.485263 -0.800655 2.475889
H  -6.676714 0.556212 3.583339
H  -6.962066 0.788363 1.861911
H  -2.839541 -3.359549 -2.057332
H  -1.853357 -2.205642 -2.944546
H  -1.332241 -3.882444 -2.795647
H  2.582778 -1.911416 -3.387527
elementType: Cl O N C H
totalener: -1554.02570838 hartree
nucrepener: 2723.53848673 hartree
electener: -4277.56419512 hartree
oneelecener: -7539.46302416 hartree
twoeener: 3261.89882904 hartree
cpcmener: -0.03392727 hartree
kineticenergy: 1548.39516117 hartree
xcener: -128.885821698843 hartree
chargesum: 0.0000000
charge: -0.099250 -0.368936 -0.406375 -0.182475 -0.394834 -0.408801 0.125678 -0.214796 0.041231 -0.085179 0.225617 -0.231723 -0.005899 -0.191610 -0.311348 -0.308066 0.012084 -0.015980 0.065116 0.286984 -0.119528 0.227948 -0.097952 -0.255256 -0.260823 0.135845 0.090952 0.092937 0.134707 0.080495 0.108208 0.145782 0.115301 0.102106 0.098173 0.097461 0.123818 0.095917 0.108499 0.102902 0.105196 0.101871 0.165126 0.072986 0.073565 0.072205 0.108797 0.081851 0.083989 0.083879 0.096025 0.079725 0.082520 0.133335
qa: -0.0992 -0.3689 -0.4064 -0.1825 -0.3948 -0.4088 0.1257 -0.2148 0.0412 -0.0852 0.2256 -0.2317 -0.0059 -0.1916 -0.3113 -0.3081 0.0121 -0.0160 0.0651 0.2870 -0.1195 0.2279 -0.0980 -0.2553 -0.2608 0.1358 0.0910 0.0929 0.1347 0.0805 0.1082 0.1458 0.1153 0.1021 0.0982 0.0975 0.1238 0.0959 0.1085 0.1029 0.1052 0.1019 0.1651 0.0730 0.0736 0.0722 0.1088 0.0819 0.0840 0.0839 0.0960 0.0797 0.0825 0.1333
va: 1.2473 2.0223 1.9292 3.2316 2.9724 2.9451 3.4394 3.7641 3.5616 3.6992 3.7196 3.9440 3.9687 3.8414 3.9308 3.9064 3.8817 3.8201 3.8712 4.0797 3.9470 3.7340 3.8999 3.9525 3.9417 4.1089 1.0090 1.0051 1.0032 1.0080 0.9844 1.0020 0.9971 0.9916 1.0076 0.9936 0.9975 1.0267 1.0055 0.9968 1.0093 1.0344 1.0353 0.9825 0.9881 1.0015 1.0060 1.0061 1.0077 1.0042 1.0052 1.0067 1.0115 0.9962
dispcorr: -0.034462139 hartree
energy: -1554.060170520854
dipole: -24.76901 25.42536 0.65635 8.41998 -7.82165 0.59833 -2.91291 5.00601 2.09310
magnitude: 2.27374 au
magnitude: 5.77938 debye
