program: Orca
programVersion: 5.0.2
elementType: Cl O O N N N C C C C C C C C C C C C C C C C C C C C H H H H H H H H H H H H H H H H H H H H H H H H H H H H
charge: 0
multiplicity: 1
keywords: wb97x-d3
keywords: def2-TZVPP
keywords: def2/J RIJCOSX
keywords: DEFGRID2
keywords: scfconv7
keywords: smallprint printgap noloewdin
keywords: NOSOSCF
formula: C20H28ClN3O2
InChI: InChI=1/C20H28ClN3O2/c1-5-17-19(21)20(24-13-23-17)22-10-12-26-18-8-7-16(9-11-25-6-2)14(3)15(18)4/h7-8,13,22H,5-6,9-12H2,1-4H3
54 atoms
Cl -0.34845 -1.616492 0.77887
O  3.029997 1.861512 0.380619
O  -3.239494 0.517975 1.245013
N  2.554643 -1.070976 0.28803
N  2.511364 -1.651303 -1.942394
N  0.512879 -2.325439 -3.018732
C  -1.110491 2.238082 0.072256
C  -0.453862 2.438492 1.293156
C  0.941595 2.287972 1.382226
C  -2.598949 2.387273 -0.121791
C  1.672914 1.924621 0.246566
C  -0.349401 1.870743 -1.033721
C  -3.359402 1.074707 -0.042578
C  1.021794 1.712957 -0.963721
C  -1.193543 2.82045 2.545465
C  1.627403 2.519576 2.69925
C  3.801167 0.970768 -0.410493
C  3.845812 -0.425624 0.186237
C  -3.86016 -0.74576 1.353231
C  1.86523 -1.490836 -0.786668
C  0.488114 -1.786574 -0.724935
C  -0.168761 -2.176458 -1.87198
C  -1.637681 -2.458775 -1.90495
C  -3.645419 -1.294072 2.743914
C  -1.977648 -3.84991 -1.374683
C  1.804274 -2.067472 -2.976461
H  -2.784872 2.792523 -1.11931
H  -3.032358 3.106665 0.574514
H  -0.842472 1.713579 -1.986479
H  -2.969186 0.379186 -0.799339
H  -4.415562 1.250174 -0.290667
H  1.564782 1.445436 -1.859845
H  -2.273128 2.818399 2.4228
H  -0.96305 2.13618 3.365662
H  -0.906793 3.819798 2.885298
H  1.30295 1.792534 3.447594
H  2.708768 2.449437 2.629334
H  1.391055 3.505925 3.102591
H  3.46718 0.945688 -1.448834
H  4.814604 1.374273 -0.41471
H  4.260706 -0.381893 1.192445
H  4.525364 -1.03452 -0.408837
H  2.016519 -0.83788 1.107925
H  -3.447767 -1.438425 0.607449
H  -4.935425 -0.663377 1.143692
H  -1.972733 -2.371601 -2.938369
H  -2.176894 -1.703137 -1.330697
H  -2.585535 -1.420517 2.969034
H  -4.080349 -0.643571 3.503679
H  -4.121447 -2.270678 2.830569
H  -3.050604 -4.026674 -1.445936
H  -1.473877 -4.625728 -1.951523
H  -1.691598 -3.968479 -0.330015
H  2.352301 -2.195819 -3.903136
elementType: Cl O N C H
totalener: -1554.02805845 hartree
nucrepener: 2748.49404054 hartree
electener: -4302.52209899 hartree
oneelecener: -7589.69004046 hartree
twoeener: 3287.16794146 hartree
cpcmener: -0.03161412 hartree
kineticenergy: 1548.39054757 hartree
xcener: -128.880773549070 hartree
chargesum: 0.0000000
charge: -0.106477 -0.370679 -0.378610 -0.185180 -0.401825 -0.403882 0.200080 -0.195109 0.029082 -0.115089 0.132920 -0.286567 -0.025039 -0.113761 -0.313477 -0.274182 0.014429 -0.014786 0.026953 0.245859 -0.052928 0.215549 -0.090388 -0.249492 -0.271839 0.156402 0.099792 0.094937 0.134829 0.087860 0.100750 0.146817 0.083965 0.107291 0.113614 0.104346 0.096598 0.105050 0.099736 0.112078 0.110818 0.092874 0.172181 0.063012 0.092628 0.084284 0.054462 0.073581 0.090416 0.090888 0.098875 0.099515 0.083709 0.133128
qa: -0.1065 -0.3707 -0.3786 -0.1852 -0.4018 -0.4039 0.2001 -0.1951 0.0291 -0.1151 0.1329 -0.2866 -0.0250 -0.1138 -0.3135 -0.2742 0.0144 -0.0148 0.0270 0.2459 -0.0529 0.2155 -0.0904 -0.2495 -0.2718 0.1564 0.0998 0.0949 0.1348 0.0879 0.1007 0.1468 0.0840 0.1073 0.1136 0.1043 0.0966 0.1051 0.0997 0.1121 0.1108 0.0929 0.1722 0.0630 0.0926 0.0843 0.0545 0.0736 0.0904 0.0909 0.0989 0.0995 0.0837 0.1331
va: 1.2456 2.0175 1.9081 3.2267 2.9710 3.0219 3.2830 3.7875 3.6519 3.7969 3.7946 3.9411 3.9429 3.7246 3.9084 3.8925 3.8417 3.8537 3.8879 4.1022 3.8375 3.7908 3.9074 3.9471 3.9237 4.1123 1.0065 1.0053 1.0037 0.9697 1.0025 0.9998 1.0290 0.9928 0.9960 0.9955 1.0256 0.9978 1.0069 1.0066 1.0038 1.0286 1.0286 0.9692 0.9969 1.0334 0.9988 1.0040 1.0046 1.0080 1.0030 1.0049 1.0090 0.9957
dispcorr: -0.034051368 hartree
energy: -1554.062109819674
dipole: -17.85992 17.53026 -0.32967 5.09535 -5.24628 -0.15093 9.55948 -9.03030 0.52918
magnitude: 0.64148 au
magnitude: 1.63051 debye
