program: Orca
programVersion: 5.0.2
elementType: Cl O O N N N C C C C C C C C C C C C C C C C C C C C H H H H H H H H H H H H H H H H H H H H H H H H H H H H
charge: 0
multiplicity: 1
keywords: wb97x-d3
keywords: def2-TZVPP
keywords: def2/J RIJCOSX
keywords: DEFGRID2
keywords: scfconv7
keywords: smallprint printgap noloewdin
keywords: NOSOSCF
formula: C20H28ClN3O2
InChI: InChI=1/C20H28ClN3O2/c1-5-17-19(21)20(24-13-23-17)22-10-12-26-18-8-7-16(9-11-25-6-2)14(3)15(18)4/h7-8,13,22H,5-6,9-12H2,1-4H3
54 atoms
Cl 3.380614 -2.84459 -0.386807
O  2.408457 1.5018 -1.181047
O  -5.272669 2.293437 -0.479023
N  3.37386 -0.144119 0.9249
N  1.275365 -0.372304 1.8638
N  -0.020734 -2.331333 1.573041
C  -1.609164 1.477561 -0.119368
C  -1.089974 0.51961 -1.002745
C  0.272429 0.531341 -1.336794
C  -3.059405 1.520798 0.283647
C  1.097714 1.529788 -0.809893
C  -0.757997 2.460084 0.374217
C  -3.888759 2.278109 -0.75274
C  0.581837 2.503305 0.033502
C  -1.962949 -0.545505 -1.605656
C  0.836283 -0.511029 -2.260111
C  3.394538 1.998048 -0.293834
C  3.411433 1.294191 1.058851
C  -5.64414 3.138839 0.593586
C  2.260198 -0.874327 1.116967
C  2.117871 -2.176807 0.59452
C  0.964355 -2.887165 0.851508
C  0.735059 -4.272636 0.333331
C  -7.151095 3.223125 0.65573
C  0.206216 -4.276567 -1.099327
C  0.195838 -1.110395 2.023509
H  -3.135704 2.018692 1.25268
H  -3.470305 0.518079 0.418022
H  -1.152869 3.212445 1.047048
H  -3.774122 1.804518 -1.731301
H  -3.502192 3.302668 -0.844947
H  1.208383 3.287284 0.43875
H  -1.882794 -0.552754 -2.693913
H  -1.673004 -1.542679 -1.265838
H  -3.014455 -0.419132 -1.362474
H  1.912162 -0.624563 -2.152988
H  0.391616 -1.488909 -2.081518
H  0.642052 -0.262522 -3.306947
H  4.339965 1.828904 -0.810833
H  3.304805 3.077749 -0.136929
H  2.582161 1.606618 1.686601
H  4.326164 1.596106 1.572096
H  4.077378 -0.541794 0.32088
H  -5.214888 4.139669 0.451115
H  -5.257269 2.761091 1.547347
H  0.011922 -4.759071 0.987802
H  1.656023 -4.854717 0.386276
H  -7.599706 2.240946 0.810491
H  -7.449532 3.85787 1.489963
H  -7.567538 3.652466 -0.256196
H  -0.725743 -3.716139 -1.178635
H  0.921525 -3.841464 -1.796698
H  0.008452 -5.298451 -1.42213
H  -0.599063 -0.666017 2.612243
elementType: Cl O N C H
totalener: -1554.02689781 hartree
nucrepener: 2655.13433704 hartree
electener: -4209.16123485 hartree
oneelecener: -7402.96740878 hartree
twoeener: 3193.80617393 hartree
cpcmener: -0.03464920 hartree
kineticenergy: 1548.40699974 hartree
xcener: -128.885544437465 hartree
chargesum: 0.0000000
charge: -0.095975 -0.370143 -0.405909 -0.177657 -0.372308 -0.395779 0.033367 -0.110526 0.009065 -0.078920 0.253039 -0.203838 -0.016299 -0.215543 -0.307004 -0.307559 0.005913 -0.044304 0.065787 0.247991 -0.110071 0.220379 -0.102272 -0.256808 -0.290769 0.142985 0.093290 0.088679 0.137516 0.107954 0.095225 0.149005 0.116286 0.097936 0.095575 0.084613 0.094846 0.127791 0.115980 0.100952 0.116415 0.116626 0.160189 0.074642 0.073166 0.080169 0.084352 0.083652 0.084388 0.082491 0.096864 0.083045 0.109352 0.132156
qa: -0.0960 -0.3701 -0.4059 -0.1777 -0.3723 -0.3958 0.0334 -0.1105 0.0091 -0.0789 0.2530 -0.2038 -0.0163 -0.2155 -0.3070 -0.3076 0.0059 -0.0443 0.0658 0.2480 -0.1101 0.2204 -0.1023 -0.2568 -0.2908 0.1430 0.0933 0.0887 0.1375 0.1080 0.0952 0.1490 0.1163 0.0979 0.0956 0.0846 0.0948 0.1278 0.1160 0.1010 0.1164 0.1166 0.1602 0.0746 0.0732 0.0802 0.0844 0.0837 0.0844 0.0825 0.0969 0.0830 0.1094 0.1322
va: 1.2464 2.0328 1.9134 3.2285 2.9636 3.0003 3.4921 3.6571 3.6125 3.7105 3.7034 3.9641 3.9387 3.8481 3.9305 3.9299 3.8963 3.8026 3.8702 4.1200 3.8578 3.7776 3.8682 3.9539 3.9325 4.1081 1.0069 1.0111 1.0019 0.9981 1.0007 0.9979 0.9912 1.0024 1.0102 1.0245 0.9887 0.9966 0.9939 0.9994 1.0298 1.0100 1.0358 0.9891 0.9819 1.0257 1.0125 1.0044 1.0076 1.0054 0.9954 1.0041 1.0080 0.9994
dispcorr: -0.033276084 hartree
energy: -1554.060173891481
dipole: -33.21767 34.87467 1.65700 13.53581 -12.70745 0.82836 -5.02385 5.17150 0.14765
magnitude: 1.85839 au
magnitude: 4.72365 debye
