program: Orca
programVersion: 5.0.2
elementType: Cl O O N N N C C C C C C C C C C C C C C C C C C C C H H H H H H H H H H H H H H H H H H H H H H H H H H H H
charge: 0
multiplicity: 1
keywords: wb97x-d3
keywords: def2-TZVPP
keywords: def2/J RIJCOSX
keywords: DEFGRID2
keywords: scfconv7
keywords: smallprint printgap noloewdin
keywords: NOSOSCF
formula: C20H28ClN3O2
InChI: InChI=1/C20H28ClN3O2/c1-5-17-19(21)20(24-13-23-17)22-10-12-26-18-8-7-16(9-11-25-6-2)14(3)15(18)4/h7-8,13,22H,5-6,9-12H2,1-4H3
54 atoms
Cl 0.306613 -2.084648 1.482108
O  3.242897 2.106973 0.360515
O  -4.254237 0.168544 0.990933
N  2.939777 -0.983793 0.56241
N  2.3213 -0.768299 -1.652239
N  0.147376 -1.333798 -2.40167
C  -0.890807 1.621584 0.251762
C  -0.187608 2.079815 -0.872518
C  1.2056 2.227776 -0.834246
C  -2.363324 1.317592 0.141303
C  1.883644 1.95788 0.359666
C  -0.189364 1.412871 1.432054
C  -2.948298 0.577972 1.328887
C  1.181457 1.59072 1.497686
C  -0.933148 2.371425 -2.145051
C  1.954773 2.650553 -2.066626
C  4.049352 1.186817 1.082457
C  4.144976 -0.188813 0.446574
C  -4.877912 -0.571111 2.020669
C  2.009449 -1.100489 -0.398908
C  0.717549 -1.604887 -0.129789
C  -0.198488 -1.694389 -1.155296
C  -1.586787 -2.220656 -0.961015
C  -6.243873 -1.017147 1.557073
C  -1.626164 -3.746565 -1.020451
C  1.380295 -0.89727 -2.56681
H  -2.524583 0.705022 -0.751656
H  -2.932282 2.239186 -0.022744
H  -0.701307 1.087211 2.32751
H  -2.96568 1.22029 2.220483
H  -2.331198 -0.295891 1.579997
H  1.690501 1.410137 2.435099
H  -1.05599 1.470573 -2.75265
H  -1.93152 2.760252 -1.949304
H  -0.421758 3.106465 -2.762768
H  1.642778 2.074739 -2.938284
H  1.775505 3.70216 -2.302759
H  3.028256 2.523649 -1.96337
H  5.048623 1.624015 1.086951
H  3.736237 1.10242 2.127183
H  4.9550 -0.718449 0.951608
H  4.424967 -0.107893 -0.600564
H  2.631122 -1.145753 1.509099
H  -4.966615 0.038836 2.929542
H  -4.266466 -1.444671 2.284491
H  -2.217454 -1.807751 -1.748471
H  -1.998652 -1.880615 -0.010166
H  -6.733335 -1.583003 2.349771
H  -6.882411 -0.167488 1.312949
H  -6.177929 -1.662495 0.680453
H  -2.649684 -4.102476 -0.903261
H  -1.252932 -4.114716 -1.976233
H  -1.025559 -4.196251 -0.22998
H  1.659081 -0.614428 -3.575938
elementType: Cl O N C H
totalener: -1554.02528208 hartree
nucrepener: 2758.42279799 hartree
electener: -4312.44808007 hartree
oneelecener: -7609.44896632 hartree
twoeener: 3297.00088625 hartree
cpcmener: -0.03370806 hartree
kineticenergy: 1548.40324964 hartree
xcener: -128.888016476532 hartree
chargesum: 0.0000000
charge: -0.102127 -0.375708 -0.394847 -0.180463 -0.380334 -0.397496 0.039509 -0.153515 0.020311 -0.069751 0.274035 -0.217895 -0.009775 -0.207350 -0.308024 -0.286832 0.021017 -0.022437 0.054510 0.224966 -0.042701 0.215221 -0.142501 -0.258161 -0.261799 0.144763 0.081161 0.100555 0.125835 0.108545 0.065252 0.141117 0.099892 0.109799 0.108508 0.100388 0.114835 0.095311 0.111078 0.098059 0.108867 0.098981 0.166052 0.077354 0.071896 0.090587 0.078632 0.085227 0.083139 0.083675 0.097702 0.094546 0.084588 0.135801
qa: -0.1021 -0.3757 -0.3948 -0.1805 -0.3803 -0.3975 0.0395 -0.1535 0.0203 -0.0698 0.2740 -0.2179 -0.0098 -0.2073 -0.3080 -0.2868 0.0210 -0.0224 0.0545 0.2250 -0.0427 0.2152 -0.1425 -0.2582 -0.2618 0.1448 0.0812 0.1006 0.1258 0.1085 0.0653 0.1411 0.0999 0.1098 0.1085 0.1004 0.1148 0.0953 0.1111 0.0981 0.1089 0.0990 0.1661 0.0774 0.0719 0.0906 0.0786 0.0852 0.0831 0.0837 0.0977 0.0945 0.0846 0.1358
va: 1.2349 2.0186 1.9143 3.2330 2.9669 2.9690 3.5365 3.7488 3.6277 3.7549 3.6054 3.8383 3.9393 3.8859 3.9254 3.9180 3.8699 3.8361 3.8708 4.2008 3.8762 3.7566 3.9155 3.9617 3.9381 4.0929 1.0049 1.0074 1.0129 0.9958 0.9892 1.0061 1.0049 0.9985 0.9979 0.9893 0.9964 1.0236 1.0046 0.9978 1.0081 1.0334 1.0324 0.9895 0.9854 1.0208 0.9989 1.0078 1.0046 1.0038 1.0042 1.0052 1.0075 0.9971
dispcorr: -0.035836431 hartree
energy: -1554.061118508899
dipole: -21.81991 22.53259 0.71268 4.48965 -5.08024 -0.59059 -2.64860 4.65962 2.01103
magnitude: 2.21381 au
magnitude: 5.62705 debye
