program: Orca
programVersion: 5.0.2
elementType: Cl O O N N N C C C C C C C C C C C C C C C C C C C C H H H H H H H H H H H H H H H H H H H H H H H H H H H H
charge: 0
multiplicity: 1
keywords: wb97x-d3
keywords: def2-TZVPP
keywords: def2/J RIJCOSX
keywords: DEFGRID2
keywords: scfconv7
keywords: smallprint printgap noloewdin
keywords: NOSOSCF
formula: C20H28ClN3O2
InChI: InChI=1/C20H28ClN3O2/c1-5-17-19(21)20(24-13-23-17)22-10-12-26-18-8-7-16(9-11-25-6-2)14(3)15(18)4/h7-8,13,22H,5-6,9-12H2,1-4H3
54 atoms
Cl 0.307712 -1.250123 -2.541382
O  3.25413 1.94989 0.51562
O  -4.339906 0.824975 -0.312298
N  2.852097 -0.648703 -1.077854
N  2.104637 -1.3940 0.97699
N  -0.065049 -2.301088 1.256919
C  -0.886855 2.125648 0.139849
C  -0.285186 1.85572 1.375656
C  1.112624 1.784169 1.483836
C  -2.380031 2.164532 -0.046562
C  1.899735 1.984671 0.346109
C  -0.071123 2.319863 -0.969591
C  -2.937595 0.756708 -0.171517
C  1.306926 2.257526 -0.880462
C  -1.101089 1.61704 2.61491
C  1.739083 1.504243 2.819468
C  4.088152 1.432996 -0.507471
C  4.085467 -0.083937 -0.579296
C  -4.967335 -0.438458 -0.417531
C  1.876816 -1.167569 -0.317835
C  0.622159 -1.527216 -0.860761
C  -0.321818 -2.116083 -0.048184
C  -1.629457 -2.62831 -0.564578
C  -5.050395 -1.18905 0.898482
C  -1.484428 -4.028119 -1.159798
C  1.123272 -1.922006 1.682628
H  -2.61533 2.725948 -0.95364
H  -2.871853 2.683503 0.779418
H  -0.525329 2.532876 -1.930131
H  -2.651015 0.16594 0.707873
H  -2.48739 0.265473 -1.045613
H  1.900214 2.427424 -1.768786
H  -2.162863 1.795673 2.465889
H  -0.992752 0.587865 2.965514
H  -0.776787 2.259612 3.435298
H  1.588218 2.338678 3.508636
H  1.294915 0.626369 3.291011
H  2.808836 1.329765 2.752829
H  3.854917 1.861948 -1.485607
H  5.097645 1.758242 -0.253858
H  4.308848 -0.511189 0.39499
H  4.895263 -0.377959 -1.249569
H  2.611634 -0.400064 -2.025163
H  -4.460608 -1.055081 -1.171679
H  -5.975578 -0.24632 -0.790335
H  -2.04178 -1.954886 -1.316037
H  -2.33704 -2.656235 0.264152
H  -5.616196 -2.110587 0.756234
H  -4.070366 -1.466385 1.288034
H  -5.563605 -0.597393 1.657867
H  -1.094983 -4.734266 -0.426564
H  -2.454583 -4.395865 -1.493096
H  -0.815243 -4.033262 -2.020299
H  1.328772 -2.078001 2.735903
elementType: Cl O N C H
totalener: -1554.02742172 hartree
nucrepener: 2755.82616279 hartree
electener: -4309.85358451 hartree
oneelecener: -7604.11289698 hartree
twoeener: 3294.25931247 hartree
cpcmener: -0.03486552 hartree
kineticenergy: 1548.40789347 hartree
xcener: -128.887021933485 hartree
chargesum: 0.0000000
charge: -0.099890 -0.370459 -0.404002 -0.177710 -0.387147 -0.401679 0.139781 -0.229162 0.039559 -0.057693 0.227457 -0.264183 0.017341 -0.169225 -0.317953 -0.285133 0.018862 -0.021387 0.043415 0.270384 -0.126471 0.266127 -0.154016 -0.263522 -0.259501 0.140978 0.086359 0.087388 0.132226 0.071980 0.073539 0.142579 0.098894 0.106365 0.115262 0.117571 0.095990 0.095429 0.098929 0.110457 0.098449 0.110770 0.166937 0.069381 0.101843 0.072951 0.095449 0.093197 0.077453 0.089534 0.095468 0.097201 0.086012 0.137617
qa: -0.0999 -0.3705 -0.4040 -0.1777 -0.3871 -0.4017 0.1398 -0.2292 0.0396 -0.0577 0.2275 -0.2642 0.0173 -0.1692 -0.3180 -0.2851 0.0189 -0.0214 0.0434 0.2704 -0.1265 0.2661 -0.1540 -0.2635 -0.2595 0.1410 0.0864 0.0874 0.1322 0.0720 0.0735 0.1426 0.0989 0.1064 0.1153 0.1176 0.0960 0.0954 0.0989 0.1105 0.0984 0.1108 0.1669 0.0694 0.1018 0.0730 0.0954 0.0932 0.0775 0.0895 0.0955 0.0972 0.0860 0.1376
va: 1.2353 2.0241 1.9241 3.2383 2.9618 2.9605 3.4309 3.7319 3.5916 3.7418 3.6545 3.9436 3.9565 3.8192 3.9206 3.9087 3.8788 3.8324 3.8995 4.1067 3.8662 3.7026 3.9070 3.8816 3.9407 4.0982 1.0159 1.0137 1.0071 0.9689 0.9990 1.0040 1.0052 0.9972 0.9968 0.9986 0.9923 1.0252 0.9972 1.0048 1.0332 1.0078 1.0318 0.9961 0.9924 1.0096 1.0124 1.0093 1.0034 1.0099 1.0044 1.0043 1.0072 0.9966
dispcorr: -0.035804901 hartree
energy: -1554.063226623108
dipole: -19.19251 20.21814 1.02563 -0.86127 0.39870 -0.46257 12.15787 -13.54545 -1.38758
magnitude: 1.78641 au
magnitude: 4.54070 debye
