program: Orca
programVersion: 5.0.2
elementType: Cl O O N N N C C C C C C C C C C C C C C C C C C C C H H H H H H H H H H H H H H H H H H H H H H H H H H H H
charge: 0
multiplicity: 1
keywords: wb97x-d3
keywords: def2-TZVPP
keywords: def2/J RIJCOSX
keywords: DEFGRID2
keywords: scfconv7
keywords: smallprint printgap noloewdin
keywords: NOSOSCF
formula: C20H28ClN3O2
InChI: InChI=1/C20H28ClN3O2/c1-5-17-19(21)20(24-13-23-17)22-10-12-26-18-8-7-16(9-11-25-6-2)14(3)15(18)4/h7-8,13,22H,5-6,9-12H2,1-4H3
54 atoms
Cl 2.90016 -2.838421 -0.570187
O  2.825573 1.576821 -0.760261
O  -4.69273 1.640711 1.00982
N  3.11653 -0.445091 1.225874
N  0.868304 -0.385189 1.762779
N  -0.682659 -1.912954 0.833164
C  -1.256065 2.282205 -0.39366
C  -0.765392 1.336883 -1.306487
C  0.613972 1.10208 -1.412422
C  -2.726925 2.524031 -0.18235
C  1.495877 1.833478 -0.609455
C  -0.347094 2.993411 0.381372
C  -3.326392 1.4453 0.719241
C  1.016775 2.78716 0.278355
C  -1.689067 0.541771 -2.185903
C  1.127391 0.078005 -2.384519
C  3.706785 1.775772 0.33173
C  3.364258 0.940392 1.560325
C  -5.569548 1.309809 -0.050534
C  1.873451 -0.948853 1.09048
C  1.604927 -2.077844 0.290893
C  0.305691 -2.522177 0.162301
C  -0.066589 -3.688224 -0.698441
C  -6.992805 1.391136 0.44975
C  0.121623 -5.016492 0.031314
C  -0.337197 -0.888679 1.589955
H  -3.259572 2.568081 -1.134767
H  -2.86617 3.496386 0.295691
H  -0.713549 3.732892 1.083621
H  -2.802649 1.456983 1.678679
H  -3.166122 0.451906 0.277609
H  1.689006 3.369597 0.894784
H  -1.662918 -0.521022 -1.934439
H  -2.725193 0.862409 -2.111407
H  -1.401153 0.62024 -3.235742
H  2.161758 -0.196788 -2.196359
H  0.537657 -0.838478 -2.349004
H  1.071352 0.445185 -3.41276
H  4.685741 1.48441 -0.050463
H  3.776708 2.829265 0.620719
H  2.499801 1.331952 2.088479
H  4.210292 1.01105 2.245919
H  3.835183 -0.878749 0.665137
H  -5.354597 0.296943 -0.416152
H  -5.437201 1.988493 -0.901553
H  0.520443 -3.686811 -1.61784
H  -1.111813 -3.574069 -0.985812
H  -7.681633 1.143207 -0.357629
H  -7.170785 0.691211 1.26701
H  -7.237483 2.395558 0.797631
H  -0.17825 -5.845216 -0.609531
H  1.161319 -5.177483 0.3160
H  -0.485093 -5.059062 0.935903
H  -1.135295 -0.407012 2.143984
elementType: Cl O N C H
totalener: -1554.02771193 hartree
nucrepener: 2686.93654627 hartree
electener: -4240.96425820 hartree
oneelecener: -7466.51230388 hartree
twoeener: 3225.54804568 hartree
cpcmener: -0.03451761 hartree
kineticenergy: 1548.39814982 hartree
xcener: -128.883114288204 hartree
chargesum: -0.0000000
charge: -0.095029 -0.369854 -0.408868 -0.183609 -0.370468 -0.396006 0.066354 -0.163157 0.014090 -0.092669 0.270137 -0.197705 -0.000718 -0.218880 -0.298996 -0.304500 0.007224 -0.045127 0.067801 0.230118 -0.076501 0.202184 -0.115995 -0.256431 -0.258866 0.143324 0.099892 0.083088 0.134229 0.104403 0.082759 0.146344 0.102682 0.095349 0.115261 0.085931 0.096831 0.125645 0.116893 0.100115 0.117102 0.114592 0.159011 0.075147 0.073105 0.079303 0.084512 0.084367 0.082522 0.083427 0.097312 0.083639 0.093094 0.135592
qa: -0.0950 -0.3699 -0.4089 -0.1836 -0.3705 -0.3960 0.0664 -0.1632 0.0141 -0.0927 0.2701 -0.1977 -0.0007 -0.2189 -0.2990 -0.3045 0.0072 -0.0451 0.0678 0.2301 -0.0765 0.2022 -0.1160 -0.2564 -0.2589 0.1433 0.0999 0.0831 0.1342 0.1044 0.0828 0.1463 0.1027 0.0953 0.1153 0.0859 0.0968 0.1256 0.1169 0.1001 0.1171 0.1146 0.1590 0.0751 0.0731 0.0793 0.0845 0.0844 0.0825 0.0834 0.0973 0.0836 0.0931 0.1356
va: 1.2489 2.0350 1.9245 3.2202 2.9694 2.9520 3.5007 3.7065 3.5904 3.7011 3.6864 3.9832 3.9406 3.8461 3.9254 3.9355 3.8941 3.8082 3.8654 4.1534 3.8856 3.7839 3.8826 3.9553 3.9264 4.0854 1.0012 1.0201 1.0050 1.0055 1.0051 1.0001 0.9968 1.0049 0.9967 1.0266 0.9894 0.9973 0.9933 1.0000 1.0282 1.0110 1.0366 0.9892 0.9815 1.0154 1.0229 1.0073 1.0057 1.0043 1.0042 1.0073 1.0048 1.0011
dispcorr: -0.033909170 hartree
energy: -1554.061621100576
dipole: -30.16453 31.61807 1.45353 7.39398 -7.44635 -0.05238 -5.05112 4.31518 -0.73594
magnitude: 1.63006 au
magnitude: 4.14329 debye
