program: Orca
programVersion: 5.0.2
elementType: Cl O O N N N C C C C C C C C C C C C C C C C C C C C H H H H H H H H H H H H H H H H H H H H H H H H H H H H
charge: 0
multiplicity: 1
keywords: wb97x-d3
keywords: def2-TZVPP
keywords: def2/J RIJCOSX
keywords: DEFGRID2
keywords: scfconv7
keywords: smallprint printgap noloewdin
keywords: NOSOSCF
formula: C20H28ClN3O2
InChI: InChI=1/C20H28ClN3O2/c1-5-17-19(21)20(24-13-23-17)22-10-12-26-18-8-7-16(9-11-25-6-2)14(3)15(18)4/h7-8,13,22H,5-6,9-12H2,1-4H3
54 atoms
Cl 2.693416 -2.730273 -0.827944
O  2.988686 1.7083 -0.469228
O  -4.706614 1.557178 0.382028
N  3.034173 -0.560839 1.23195
N  0.795158 -0.460988 1.789152
N  -0.835493 -1.780023 0.694675
C  -1.124787 2.301038 -0.336893
C  -0.543328 1.475285 -1.310693
C  0.844657 1.27572 -1.334062
C  -2.612473 2.51991 -0.244338
C  1.645757 1.918957 -0.384375
C  -0.29516 2.925367 0.587599
C  -3.31267 1.343422 0.417183
C  1.077642 2.7498 0.57153
C  -1.374016 0.773346 -2.347481
C  1.453755 0.387703 -2.380663
C  3.784088 1.733945 0.703107
C  3.341826 0.743622 1.776335
C  -5.433045 0.508968 0.990887
C  1.769717 -0.987524 1.044994
C  1.441721 -1.997996 0.118412
C  0.119579 -2.353001 -0.052593
C  -0.316903 -3.389022 -1.040264
C  -6.912649 0.750515 0.8077
C  -0.201925 -4.800186 -0.467092
C  -0.435718 -0.874565 1.566421
H  -3.045713 2.690572 -1.232904
H  -2.805546 3.422947 0.339022
H  -0.732219 3.571934 1.33938
H  -2.960139 1.240022 1.453599
H  -3.058816 0.405773 -0.096872
H  1.688912 3.261314 1.303754
H  -1.349003 -0.310489 -2.209024
H  -2.41798 1.074798 -2.33069
H  -0.998213 0.966664 -3.353669
H  1.441167 0.868548 -3.362393
H  2.485319 0.128974 -2.161633
H  0.898574 -0.544875 -2.484271
H  4.786629 1.481946 0.355764
H  3.838788 2.734656 1.144136
H  2.474138 1.10338 2.320374
H  4.156395 0.666354 2.498506
H  3.735578 -0.946611 0.617043
H  -5.188491 0.446168 2.059658
H  -5.153642 -0.455555 0.545873
H  0.26789 -3.314283 -1.958157
H  -1.354777 -3.186213 -1.304459
H  -7.226065 1.6917 1.260622
H  -7.187539 0.767144 -0.247469
H  -7.476758 -0.050991 1.284606
H  -0.805746 -4.909601 0.433795
H  -0.553043 -5.532493 -1.193799
H  0.828005 -5.050866 -0.213865
H  -1.206346 -0.423584 2.182322
elementType: Cl O N C H
totalener: -1554.02829365 hartree
nucrepener: 2701.28828976 hartree
electener: -4255.31658341 hartree
oneelecener: -7495.30749896 hartree
twoeener: 3239.99091555 hartree
cpcmener: -0.03316307 hartree
kineticenergy: 1548.39559888 hartree
xcener: -128.882390221450 hartree
chargesum: 0.0000000
charge: -0.094733 -0.370508 -0.398153 -0.178504 -0.372474 -0.390729 0.071460 -0.174693 0.032628 -0.064725 0.249352 -0.205267 0.008789 -0.202912 -0.312191 -0.296972 0.008701 -0.048718 0.064622 0.229698 -0.078779 0.199929 -0.114132 -0.253772 -0.259403 0.142636 0.088327 0.087047 0.135294 0.084485 0.071561 0.146318 0.105035 0.099791 0.116163 0.125307 0.086523 0.091308 0.116591 0.100634 0.117403 0.115036 0.158401 0.072847 0.069054 0.081705 0.082566 0.083045 0.082457 0.084727 0.093059 0.097214 0.083791 0.133161
qa: -0.0947 -0.3705 -0.3982 -0.1785 -0.3725 -0.3907 0.0715 -0.1747 0.0326 -0.0647 0.2494 -0.2053 0.0088 -0.2029 -0.3122 -0.2970 0.0087 -0.0487 0.0646 0.2297 -0.0788 0.1999 -0.1141 -0.2538 -0.2594 0.1426 0.0883 0.0870 0.1353 0.0845 0.0716 0.1463 0.1050 0.0998 0.1162 0.1253 0.0865 0.0913 0.1166 0.1006 0.1174 0.1150 0.1584 0.0728 0.0691 0.0817 0.0826 0.0830 0.0825 0.0847 0.0931 0.0972 0.0838 0.1332
va: 1.2493 2.0354 1.9308 3.2273 2.9713 2.9555 3.5027 3.6786 3.5840 3.7443 3.6943 3.9667 3.9388 3.8408 3.9262 3.9254 3.8839 3.8046 3.8668 4.1544 3.8828 3.7841 3.8790 3.9571 3.9268 4.0948 1.0126 1.0142 1.0041 0.9963 1.0018 0.9995 0.9910 1.0043 0.9965 0.9986 1.0295 0.9911 0.9931 0.9988 1.0298 1.0098 1.0366 0.9888 0.9877 1.0153 1.0230 1.0045 1.0045 1.0078 1.0051 1.0041 1.0076 1.0018
dispcorr: -0.034013341 hartree
energy: -1554.062306989767
dipole: -28.72782 30.27083 1.54301 5.24127 -5.73117 -0.48990 -1.85792 2.15192 0.29400
magnitude: 1.64539 au
magnitude: 4.18226 debye
