program: Orca
programVersion: 5.0.2
elementType: Cl O O N N N C C C C C C C C C C C C C C C C C C C C H H H H H H H H H H H H H H H H H H H H H H H H H H H H
charge: 0
multiplicity: 1
keywords: wb97x-d3
keywords: def2-TZVPP
keywords: def2/J RIJCOSX
keywords: DEFGRID2
keywords: scfconv7
keywords: smallprint printgap noloewdin
keywords: NOSOSCF
formula: C20H28ClN3O2
InChI: InChI=1/C20H28ClN3O2/c1-5-17-19(21)20(24-13-23-17)22-10-12-26-18-8-7-16(9-11-25-6-2)14(3)15(18)4/h7-8,13,22H,5-6,9-12H2,1-4H3
54 atoms
Cl 2.487651 -2.792204 -1.101968
O  2.98648 1.77825 -0.540959
O  -4.591543 1.576547 0.879108
N  2.992596 -0.6438 0.930519
N  0.815195 -0.564265 1.698645
N  -0.87302 -1.971612 0.821813
C  -1.090674 2.425886 -0.052581
C  -0.605044 1.653715 -1.118718
C  0.770936 1.419895 -1.253531
C  -2.563055 2.631647 0.187598
C  1.656178 2.004691 -0.342624
C  -0.178904 2.988385 0.833717
C  -3.194922 1.388307 0.795497
C  1.184887 2.79969 0.692288
C  -1.532117 1.05373 -2.138613
C  1.281784 0.549205 -2.365413
C  3.841454 1.64453 0.580992
C  3.385135 0.586877 1.578254
C  -5.274485 0.533969 1.547965
C  1.723707 -1.080559 0.868279
C  1.326246 -2.107067 -0.015291
C  0.018138 -2.541616 -0.003625
C  -0.480619 -3.631167 -0.900727
C  -5.302128 -0.780082 0.788361
C  -0.850018 -3.115464 -2.28954
C  -0.419199 -1.016095 1.60945
H  -3.083139 2.883441 -0.740067
H  -2.704748 3.477627 0.863674
H  -0.543683 3.595354 1.653901
H  -2.770798 1.208815 1.793751
H  -2.950229 0.511125 0.184574
H  1.864796 3.267873 1.392636
H  -2.545815 1.43947 -2.064597
H  -1.184407 1.257777 -3.15267
H  -1.59306 -0.033074 -2.042418
H  1.297628 1.08456 -3.318565
H  2.29104 0.190938 -2.180416
H  0.647722 -0.325874 -2.507116
H  4.80839 1.368298 0.158826
H  3.981674 2.593263 1.109142
H  2.55295 0.93857 2.180695
H  4.215847 0.405991 2.263757
H  3.638709 -1.011851 0.248601
H  -6.295908 0.891017 1.694628
H  -4.843587 0.375517 2.545687
H  -1.360579 -4.073719 -0.433777
H  0.265939 -4.421704 -0.988718
H  -5.953364 -1.484524 1.307227
H  -5.695191 -0.646262 -0.22074
H  -4.318418 -1.243949 0.713774
H  -1.624483 -2.350106 -2.233656
H  0.009299 -2.688262 -2.80617
H  -1.232793 -3.93101 -2.902587
H  -1.138176 -0.561269 2.281868
elementType: Cl O N C H
totalener: -1554.02724827 hartree
nucrepener: 2727.70252791 hartree
electener: -4281.72977619 hartree
oneelecener: -7548.02976133 hartree
twoeener: 3266.29998514 hartree
cpcmener: -0.03357004 hartree
kineticenergy: 1548.39847680 hartree
xcener: -128.885065923394 hartree
chargesum: -0.0000000
charge: -0.094571 -0.373563 -0.402305 -0.171390 -0.375645 -0.395052 0.048814 -0.148389 0.025651 -0.065767 0.249600 -0.202627 0.020092 -0.209314 -0.321168 -0.294561 0.014200 -0.055162 0.046181 0.260103 -0.124948 0.226635 -0.100793 -0.252961 -0.298537 0.141862 0.088113 0.086838 0.135893 0.085272 0.063023 0.150076 0.106929 0.117445 0.102037 0.125775 0.084274 0.087984 0.115739 0.100734 0.118636 0.116765 0.161332 0.095636 0.068155 0.079179 0.083319 0.093345 0.082373 0.072740 0.100061 0.087520 0.110845 0.133576
qa: -0.0946 -0.3736 -0.4023 -0.1714 -0.3756 -0.3951 0.0488 -0.1484 0.0257 -0.0658 0.2496 -0.2026 0.0201 -0.2093 -0.3212 -0.2946 0.0142 -0.0552 0.0462 0.2601 -0.1249 0.2266 -0.1008 -0.2530 -0.2985 0.1419 0.0881 0.0868 0.1359 0.0853 0.0630 0.1501 0.1069 0.1174 0.1020 0.1258 0.0843 0.0880 0.1157 0.1007 0.1186 0.1168 0.1613 0.0956 0.0682 0.0792 0.0833 0.0933 0.0824 0.0727 0.1001 0.0875 0.1108 0.1336
va: 1.2489 2.0277 1.9293 3.2353 2.9693 2.9658 3.5385 3.6663 3.5922 3.7543 3.7097 3.9657 3.9502 3.8451 3.9175 3.9245 3.8781 3.8062 3.9077 4.0980 3.8389 3.7677 3.8557 3.8725 3.9308 4.0857 1.0160 1.0155 1.0040 0.9978 0.9779 0.9970 1.0054 0.9974 0.9919 0.9984 1.0293 0.9883 0.9940 0.9987 1.0313 1.0098 1.0355 0.9903 0.9998 1.0257 1.0128 1.0105 1.0094 1.0133 0.9974 1.0031 1.0076 0.9987
dispcorr: -0.035134349 hartree
energy: -1554.062382621114
dipole: -26.33959 27.94419 1.60460 6.20647 -6.78943 -0.58296 -3.20573 3.40415 0.19842
magnitude: 1.71871 au
magnitude: 4.36861 debye
