program: Orca
programVersion: 5.0.2
elementType: Cl O O N N N C C C C C C C C C C C C C C C C C C C C H H H H H H H H H H H H H H H H H H H H H H H H H H H H
charge: 0
multiplicity: 1
keywords: wb97x-d3
keywords: def2-TZVPP
keywords: def2/J RIJCOSX
keywords: DEFGRID2
keywords: scfconv7
keywords: smallprint printgap noloewdin
keywords: NOSOSCF
formula: C20H28ClN3O2
InChI: InChI=1/C20H28ClN3O2/c1-5-17-19(21)20(24-13-23-17)22-10-12-26-18-8-7-16(9-11-25-6-2)14(3)15(18)4/h7-8,13,22H,5-6,9-12H2,1-4H3
54 atoms
Cl 0.925552 -2.201807 1.850741
O  2.383299 2.137145 -0.320389
O  -3.71805 1.84039 1.448139
N  3.19919 -0.609014 0.71826
N  2.679734 -1.043327 -1.492349
N  0.748163 -2.269552 -2.102001
C  -1.459331 0.571947 0.049928
C  -0.935326 0.922784 -1.201911
C  0.366896 1.435653 -1.309254
C  -2.836684 -0.012734 0.225202
C  1.131257 1.620971 -0.151752
C  -0.676827 0.787065 1.17795
C  -3.932667 1.036856 0.310383
C  0.600166 1.310878 1.093607
C  -1.726146 0.735528 -2.466707
C  0.919534 1.779227 -2.663298
C  3.4173 1.869613 0.613537
C  4.069092 0.510331 0.422369
C  -4.668614 2.877098 1.576304
C  2.392715 -1.178692 -0.197453
C  1.267115 -1.942803 0.174696
C  0.440945 -2.445404 -0.807107
C  -0.803007 -3.216184 -0.494793
C  -4.385061 3.661797 2.835274
C  -0.508042 -4.68962 -0.220312
C  1.849624 -1.592135 -2.357966
H  -2.858557 -0.616886 1.135986
H  -3.08772 -0.695152 -0.588471
H  -1.064877 0.519335 2.152893
H  -4.911717 0.541626 0.367994
H  -3.941764 1.65277 -0.599818
H  1.169169 1.452401 2.002185
H  -1.28654 -0.042549 -3.095665
H  -2.759803 0.454603 -2.285125
H  -1.741719 1.647046 -3.066228
H  0.753439 0.97169 -3.37756
H  0.432302 2.665672 -3.077448
H  1.986946 1.978605 -2.643515
H  4.175208 2.633928 0.436643
H  3.081382 1.993474 1.646071
H  4.928489 0.464976 1.092764
H  4.451901 0.410235 -0.590051
H  2.872807 -0.643259 1.672746
H  -5.684862 2.462187 1.612996
H  -4.630496 3.539881 0.701364
H  -1.476196 -3.132161 -1.348103
H  -1.315706 -2.776766 0.362246
H  -4.465909 3.03539 3.724393
H  -3.388525 4.104644 2.815382
H  -5.106779 4.472476 2.933373
H  -1.433421 -5.228671 -0.018839
H  -0.0275 -5.162028 -1.077034
H  0.144207 -4.817474 0.643229
H  2.107757 -1.469998 -3.404053
elementType: Cl O N C H
totalener: -1554.02699187 hartree
nucrepener: 2743.17693972 hartree
electener: -4297.20393159 hartree
oneelecener: -7579.91175675 hartree
twoeener: 3282.70782516 hartree
cpcmener: -0.03566812 hartree
kineticenergy: 1548.41317454 hartree
xcener: -128.888470393229 hartree
chargesum: 0.0000000
charge: -0.100832 -0.366932 -0.389676 -0.191774 -0.383644 -0.394373 0.136725 -0.135446 -0.003773 -0.141994 0.292704 -0.272979 -0.002011 -0.201815 -0.307788 -0.292336 0.008539 -0.009568 0.062626 0.224070 -0.042214 0.212920 -0.135141 -0.256695 -0.261767 0.145888 0.092765 0.097732 0.125249 0.093045 0.089273 0.140065 0.099546 0.090895 0.115134 0.098913 0.117925 0.097375 0.111517 0.100555 0.108280 0.097199 0.166649 0.068036 0.070467 0.087461 0.076804 0.082196 0.082824 0.085912 0.096984 0.093907 0.084607 0.135970
qa: -0.1008 -0.3669 -0.3897 -0.1918 -0.3836 -0.3944 0.1367 -0.1354 -0.0038 -0.1420 0.2927 -0.2730 -0.0020 -0.2018 -0.3078 -0.2923 0.0085 -0.0096 0.0626 0.2241 -0.0422 0.2129 -0.1351 -0.2567 -0.2618 0.1459 0.0928 0.0977 0.1252 0.0930 0.0893 0.1401 0.0995 0.0909 0.1151 0.0989 0.1179 0.0974 0.1115 0.1006 0.1083 0.0972 0.1666 0.0680 0.0705 0.0875 0.0768 0.0822 0.0828 0.0859 0.0970 0.0939 0.0846 0.1360
va: 1.2353 2.0311 1.9217 3.2333 2.9716 2.9709 3.2656 3.6821 3.6229 3.8356 3.5882 3.9230 3.9543 3.8063 3.9186 3.9085 3.8852 3.8339 3.8786 4.2027 3.8814 3.7764 3.8877 3.9589 3.9339 4.0936 1.0128 1.0030 1.0180 0.9990 0.9870 1.0087 1.0070 1.0113 0.9922 0.9916 0.9969 1.0251 1.0035 0.9962 1.0089 1.0325 1.0319 0.9876 0.9888 1.0202 1.0136 1.0046 1.0040 1.0081 1.0042 1.0046 1.0085 0.9970
dispcorr: -0.034983767 hartree
energy: -1554.061975642079
dipole: -23.88405 23.69341 -0.19064 13.44571 -13.06289 0.38282 -4.28888 5.34555 1.05667
magnitude: 1.13993 au
magnitude: 2.89748 debye
