program: Orca
programVersion: 5.0.2
elementType: Cl O O N N N C C C C C C C C C C C C C C C C C C C C H H H H H H H H H H H H H H H H H H H H H H H H H H H H
charge: 0
multiplicity: 1
keywords: wb97x-d3
keywords: def2-TZVPP
keywords: def2/J RIJCOSX
keywords: DEFGRID2
keywords: scfconv7
keywords: smallprint printgap noloewdin
keywords: NOSOSCF
formula: C20H28ClN3O2
InChI: InChI=1/C20H28ClN3O2/c1-5-17-19(21)20(24-13-23-17)22-10-12-26-18-8-7-16(9-11-25-6-2)14(3)15(18)4/h7-8,13,22H,5-6,9-12H2,1-4H3
54 atoms
Cl 1.464626 -1.757864 1.984366
O  2.680688 2.24688 -0.608225
O  -3.990742 1.238641 -0.714804
N  3.086379 -0.601606 -0.263276
N  1.612118 -1.200636 -1.924435
N  -0.474447 -2.200286 -1.438561
C  -1.166708 1.287089 0.673597
C  -0.135708 1.508862 1.599965
C  1.165648 1.806567 1.16883
C  -2.526653 0.834533 1.153669
C  1.413217 1.937375 -0.200549
C  -0.889596 1.459454 -0.677775
C  -3.450467 0.234051 0.111569
C  0.379342 1.796064 -1.114427
C  -0.41647 1.374722 3.070809
C  2.28357 1.950675 2.162651
C  3.247985 1.472115 -1.653084
C  3.91132 0.199685 -1.139597
C  -4.766715 0.71563 -1.769769
C  1.927043 -1.165467 -0.629778
C  1.029128 -1.717315 0.309766
C  -0.178113 -2.212657 -0.129954
C  -1.192664 -2.817778 0.789698
C  -5.271412 1.8484 -2.63219
C  -0.916451 -4.302614 1.018902
C  0.440637 -1.713091 -2.251111
H  -3.05147 1.653177 1.660094
H  -2.391342 0.067502 1.921156
H  -1.668112 1.343909 -1.418695
H  -4.258885 -0.303894 0.626677
H  -2.91141 -0.5129 -0.489303
H  0.552461 1.938296 -2.173606
H  -0.333165 0.335683 3.401637
H  0.273383 1.958434 3.677008
H  -1.420826 1.711325 3.325061
H  2.185071 2.865949 2.751436
H  2.296717 1.121306 2.870501
H  3.258636 1.986154 1.68356
H  2.511574 1.233775 -2.42093
H  4.013906 2.090912 -2.124122
H  4.805232 0.450015 -0.56941
H  4.239085 -0.383098 -2.003392
H  3.2631 -0.50439 0.723401
H  -5.613253 0.136663 -1.373825
H  -4.169098 0.020844 -2.376471
H  -2.176235 -2.696092 0.33421
H  -1.213265 -2.291928 1.745314
H  -4.4479 2.420009 -3.063122
H  -5.864097 1.448339 -3.455597
H  -5.906477 2.532787 -2.067994
H  -0.921977 -4.85209 0.076924
H  0.050572 -4.464387 1.495959
H  -1.681134 -4.737636 1.662871
H  0.205424 -1.726097 -3.309951
elementType: Cl O N C H
totalener: -1554.03445435 hartree
nucrepener: 2764.96877049 hartree
electener: -4319.00322484 hartree
oneelecener: -7622.59252720 hartree
twoeener: 3303.58930236 hartree
cpcmener: -0.02640978 hartree
kineticenergy: 1548.40022834 hartree
xcener: -128.885581976431 hartree
chargesum: -0.0000000
charge: -0.101112 -0.373516 -0.382590 -0.186826 -0.389605 -0.397228 0.028685 -0.127646 -0.009040 -0.101259 0.291634 -0.184582 -0.004820 -0.217394 -0.307869 -0.293646 0.027976 -0.053924 0.048566 0.249036 -0.063719 0.246258 -0.147268 -0.254701 -0.259468 0.149788 0.091095 0.089640 0.144487 0.100858 0.071141 0.133779 0.097420 0.105452 0.109489 0.114076 0.096556 0.097110 0.097241 0.108208 0.111675 0.097986 0.175643 0.078786 0.072355 0.087016 0.078623 0.083856 0.084473 0.082830 0.093935 0.084839 0.096292 0.129407
qa: -0.1011 -0.3735 -0.3826 -0.1868 -0.3896 -0.3972 0.0287 -0.1276 -0.0090 -0.1013 0.2916 -0.1846 -0.0048 -0.2174 -0.3079 -0.2936 0.0280 -0.0539 0.0486 0.2490 -0.0637 0.2463 -0.1473 -0.2547 -0.2595 0.1498 0.0911 0.0896 0.1445 0.1009 0.0711 0.1338 0.0974 0.1055 0.1095 0.1141 0.0966 0.0971 0.0972 0.1082 0.1117 0.0980 0.1756 0.0788 0.0724 0.0870 0.0786 0.0839 0.0845 0.0828 0.0939 0.0848 0.0963 0.1294
va: 1.2423 2.0192 1.9251 3.2194 2.9729 2.9553 3.5404 3.7104 3.6623 3.8874 3.5980 3.7854 3.9247 3.9065 3.9217 3.9169 3.8233 3.8510 3.8726 4.1288 3.9425 3.6916 3.9149 3.9592 3.9362 4.1202 1.0134 0.9985 1.0062 0.9976 1.0112 1.0051 0.9997 0.9973 0.9974 0.9979 0.9944 1.0221 1.0137 1.0058 0.9993 1.0199 1.0244 0.9914 0.9888 1.0188 1.0103 1.0029 1.0079 1.0045 1.0061 1.0071 1.0044 0.9971
dispcorr: -0.035863423 hartree
energy: -1554.070317771479
dipole: -21.61658 22.28168 0.66511 5.43570 -6.14914 -0.71344 -1.51961 2.16142 0.64180
magnitude: 1.16759 au
magnitude: 2.96779 debye
