program: Orca
programVersion: 5.0.2
elementType: Cl O O N N N C C C C C C C C C C C C C C C C C C C C H H H H H H H H H H H H H H H H H H H H H H H H H H H H
charge: 0
multiplicity: 1
keywords: wb97x-d3
keywords: def2-TZVPP
keywords: def2/J RIJCOSX
keywords: DEFGRID2
keywords: scfconv7
keywords: smallprint printgap noloewdin
keywords: NOSOSCF
formula: C20H28ClN3O2
InChI: InChI=1/C20H28ClN3O2/c1-5-17-19(21)20(24-13-23-17)22-10-12-26-18-8-7-16(9-11-25-6-2)14(3)15(18)4/h7-8,13,22H,5-6,9-12H2,1-4H3
54 atoms
Cl 1.129026 -0.586465 -2.72698
O  2.399052 1.757297 1.444522
O  -3.918035 0.779816 1.690162
N  3.177313 -0.250778 -0.540669
N  2.458746 -2.052601 0.694718
N  0.518588 -3.268399 0.11117
C  -1.398739 0.645381 0.14405
C  -0.67794 1.643113 -0.523841
C  0.616723 1.988462 -0.101051
C  -2.762366 0.18512 -0.303705
C  1.156861 1.368917 1.026958
C  -0.833194 0.058375 1.272512
C  -3.901047 0.991621 0.298585
C  0.420742 0.420359 1.726965
C  -1.235808 2.348369 -1.728236
C  1.413195 2.996008 -0.879544
C  3.354595 0.752184 1.743936
C  4.061013 0.227402 0.499411
C  -4.819625 1.601405 2.399893
C  2.320667 -1.270119 -0.377031
C  1.274962 -1.531235 -1.285104
C  0.364149 -2.525481 -0.991066
C  -0.821248 -2.79595 -1.870616
C  -4.309854 3.014711 2.610968
C  -1.838448 -3.758023 -1.283899
C  1.562731 -3.003716 0.869977
H  -2.89654 -0.865924 -0.032541
H  -2.858948 0.223768 -1.390021
H  -1.382863 -0.707593 1.806227
H  -4.853881 0.675064 -0.149222
H  -3.771479 2.053238 0.051343
H  0.818118 -0.044341 2.620144
H  -1.114059 3.429896 -1.648205
H  -0.720088 2.042799 -2.642719
H  -2.295901 2.162263 -1.87974
H  0.978388 3.996281 -0.81021
H  2.440527 3.071249 -0.532653
H  1.442664 2.742677 -1.941233
H  4.101623 1.216906 2.389879
H  2.911737 -0.070339 2.3074
H  4.753831 -0.557793 0.810044
H  4.660562 1.018835 0.051569
H  3.000509 0.383498 -1.302203
H  -4.968879 1.120257 3.369467
H  -5.799583 1.623436 1.904116
H  -0.459879 -3.175595 -2.831843
H  -1.307277 -1.844871 -2.103104
H  -5.003088 3.563861 3.250194
H  -3.335636 3.010373 3.102638
H  -4.217782 3.571885 1.677708
H  -2.6807 -3.860442 -1.968419
H  -1.420521 -4.750605 -1.12167
H  -2.229714 -3.402972 -0.330173
H  1.69882 -3.632465 1.743654
elementType: Cl O N C H
totalener: -1554.03368098 hartree
nucrepener: 2748.24367553 hartree
electener: -4302.27735651 hartree
oneelecener: -7589.50334475 hartree
twoeener: 3287.22598824 hartree
cpcmener: -0.02744138 hartree
kineticenergy: 1548.40323328 hartree
xcener: -128.886776967519 hartree
chargesum: 0.0000000
charge: -0.102845 -0.372232 -0.376140 -0.185074 -0.394196 -0.399802 0.186199 -0.159932 -0.018824 -0.125451 0.230817 -0.257340 -0.025967 -0.158782 -0.300585 -0.282890 0.027189 -0.052780 0.040693 0.261943 -0.065415 0.212292 -0.112611 -0.249187 -0.260996 0.139355 0.082617 0.098917 0.123192 0.091930 0.092742 0.136819 0.110600 0.099543 0.089347 0.115446 0.096512 0.094434 0.108874 0.097672 0.096893 0.111983 0.172762 0.088565 0.063077 0.108803 0.082944 0.089865 0.081224 0.079076 0.096053 0.085235 0.078392 0.129044
qa: -0.1028 -0.3722 -0.3761 -0.1851 -0.3942 -0.3998 0.1862 -0.1599 -0.0188 -0.1255 0.2308 -0.2573 -0.0260 -0.1588 -0.3006 -0.2829 0.0272 -0.0528 0.0407 0.2619 -0.0654 0.2123 -0.1126 -0.2492 -0.2610 0.1394 0.0826 0.0989 0.1232 0.0919 0.0927 0.1368 0.1106 0.0995 0.0893 0.1154 0.0965 0.0944 0.1089 0.0977 0.0969 0.1120 0.1728 0.0886 0.0631 0.1088 0.0829 0.0899 0.0812 0.0791 0.0961 0.0852 0.0784 0.1290
va: 1.2426 2.0186 1.9276 3.2121 2.9739 2.9658 3.2205 3.6566 3.6894 3.8030 3.6792 3.9115 3.9974 3.8292 3.9188 3.9054 3.8185 3.8561 3.9250 4.1222 3.9674 3.7655 3.8963 3.8971 3.9293 4.1322 1.0209 1.0012 1.0210 1.0021 0.9741 1.0013 0.9943 1.0000 1.0104 0.9992 1.0238 0.9956 1.0060 1.0134 1.0209 0.9996 1.0262 0.9913 0.9979 1.0023 0.9977 1.0119 1.0077 1.0036 1.0044 1.0140 1.0100 0.9959
dispcorr: -0.035347708 hartree
energy: -1554.069028688572
dipole: -24.79798 24.84156 0.04358 13.30305 -12.13903 1.16403 7.79352 -8.81410 -1.02057
magnitude: 1.54868 au
magnitude: 3.93644 debye
