program: Orca
programVersion: 5.0.2
elementType: Cl O O N N N C C C C C C C C C C C C C C C C C C C C H H H H H H H H H H H H H H H H H H H H H H H H H H H H
charge: 0
multiplicity: 1
keywords: wb97x-d3
keywords: def2-TZVPP
keywords: def2/J RIJCOSX
keywords: DEFGRID2
keywords: scfconv7
keywords: smallprint printgap noloewdin
keywords: NOSOSCF
formula: C20H28ClN3O2
InChI: InChI=1/C20H28ClN3O2/c1-5-17-19(21)20(24-13-23-17)22-10-12-26-18-8-7-16(9-11-25-6-2)14(3)15(18)4/h7-8,13,22H,5-6,9-12H2,1-4H3
54 atoms
Cl 0.365083 -1.803914 1.413163
O  3.135411 2.241431 0.010141
O  -4.328837 0.188069 0.002711
N  2.905785 -0.680235 0.251055
N  2.412622 -1.232738 -1.922064
N  0.394109 -2.307503 -2.517144
C  -1.018004 1.980797 0.01628
C  -0.303486 2.00928 1.220779
C  1.099585 2.075973 1.212245
C  -2.516995 1.855565 -0.041085
C  1.776356 2.120659 -0.008348
C  -0.309021 2.020729 -1.180837
C  -2.942045 0.395643 0.116635
C  1.070411 2.099193 -1.205312
C  -0.99834 1.943852 2.551079
C  1.852922 2.078479 2.510344
C  3.899567 1.355472 -0.79236
C  4.120699 0.014019 -0.112439
C  -5.079845 0.593642 1.12788
C  2.06159 -1.222274 -0.635424
C  0.821573 -1.785876 -0.257993
C  0.005941 -2.319421 -1.232485
C  -1.310012 -2.968902 -0.935837
C  -6.505322 0.120896 0.961412
C  -1.137825 -4.450783 -0.607449
C  1.567739 -1.772621 -2.779854
H  -2.872599 2.220021 -1.007978
H  -2.992628 2.481338 0.717269
H  -0.851491 2.003524 -2.119078
H  -2.568515 -0.004502 1.070349
H  -2.476192 -0.19094 -0.679742
H  1.585288 2.157173 -2.155943
H  -0.739249 1.028883 3.089079
H  -0.70885 2.776371 3.195349
H  -2.081787 1.967513 2.467411
H  1.592046 1.213191 3.12372
H  2.929752 2.06519 2.36722
H  1.618676 2.962696 3.107808
H  3.453595 1.217275 -1.778631
H  4.870345 1.831386 -0.941396
H  4.688828 0.154231 0.806881
H  4.730726 -0.606061 -0.772956
H  2.602566 -0.600627 1.20782
H  -5.065086 1.684551 1.245764
H  -4.649154 0.169873 2.046073
H  -1.942583 -2.862236 -1.817921
H  -1.817686 -2.465902 -0.112291
H  -6.964181 0.541983 0.065748
H  -6.561576 -0.9666 0.897297
H  -7.101656 0.43579 1.818325
H  -0.530393 -4.597341 0.28623
H  -2.108768 -4.913699 -0.429035
H  -0.660275 -4.98478 -1.42967
H  1.879246 -1.770261 -3.818998
elementType: Cl O N C H
totalener: -1554.03789156 hartree
nucrepener: 2706.19998731 hartree
electener: -4260.23787887 hartree
oneelecener: -7504.40842465 hartree
twoeener: 3244.17054579 hartree
cpcmener: -0.02730376 hartree
kineticenergy: 1548.39791829 hartree
xcener: -128.880652697751 hartree
chargesum: -0.0000000
charge: -0.101423 -0.371876 -0.390563 -0.176856 -0.400776 -0.400890 0.149025 -0.192740 -0.013219 -0.088515 0.211341 -0.249506 -0.006095 -0.155683 -0.299639 -0.276990 0.030236 -0.049993 0.064909 0.295995 -0.115042 0.243417 -0.130671 -0.254823 -0.256373 0.148807 0.082139 0.098707 0.130211 0.075176 0.106134 0.141022 0.102727 0.111724 0.090812 0.095512 0.097933 0.115164 0.094569 0.108522 0.113580 0.096958 0.175492 0.069928 0.071109 0.090631 0.068804 0.083426 0.081864 0.082618 0.083561 0.095919 0.093367 0.130334
qa: -0.1014 -0.3719 -0.3906 -0.1769 -0.4008 -0.4009 0.1490 -0.1927 -0.0132 -0.0885 0.2113 -0.2495 -0.0061 -0.1557 -0.2996 -0.2770 0.0302 -0.0500 0.0649 0.2960 -0.1150 0.2434 -0.1307 -0.2548 -0.2564 0.1488 0.0821 0.0987 0.1302 0.0752 0.1061 0.1410 0.1027 0.1117 0.0908 0.0955 0.0979 0.1152 0.0946 0.1085 0.1136 0.0970 0.1755 0.0699 0.0711 0.0906 0.0688 0.0834 0.0819 0.0826 0.0836 0.0959 0.0934 0.1303
va: 1.2340 2.0162 1.9401 3.2246 2.9561 3.0119 3.4074 3.7421 3.6831 3.7031 3.7308 3.9404 3.9514 3.8278 3.9182 3.9003 3.8206 3.8469 3.8759 4.0231 3.8656 3.7482 3.8968 3.9583 3.9343 4.1289 1.0195 0.9999 1.0069 1.0026 0.9951 0.9995 0.9968 0.9993 1.0066 0.9960 1.0245 0.9998 1.0148 1.0068 1.0003 1.0254 1.0231 0.9807 0.9888 1.0205 1.0143 1.0044 1.0061 1.0077 1.0060 1.0046 1.0060 0.9956
dispcorr: -0.033398083 hartree
energy: -1554.071289644472
dipole: -22.12671 22.76581 0.63910 5.69066 -5.48479 0.20587 7.79711 -6.12433 1.67278
magnitude: 1.80251 au
magnitude: 4.58161 debye
