program: Orca
programVersion: 5.0.2
elementType: Cl O O N N N C C C C C C C C C C C C C C C C C C C C H H H H H H H H H H H H H H H H H H H H H H H H H H H H
charge: 0
multiplicity: 1
keywords: wb97x-d3
keywords: def2-TZVPP
keywords: def2/J RIJCOSX
keywords: DEFGRID2
keywords: scfconv7
keywords: smallprint printgap noloewdin
keywords: NOSOSCF
formula: C20H28ClN3O2
InChI: InChI=1/C20H28ClN3O2/c1-5-17-19(21)20(24-13-23-17)22-10-12-26-18-8-7-16(9-11-25-6-2)14(3)15(18)4/h7-8,13,22H,5-6,9-12H2,1-4H3
54 atoms
Cl -0.187953 -0.348289 -2.134848
O  3.29948 1.810971 0.813493
O  -4.390148 0.753239 0.957013
N  2.668367 -0.250718 -1.19242
N  2.51787 -2.110708 0.146093
N  0.503803 -3.32211 0.388191
C  -0.811737 1.654004 1.446009
C  -0.270537 2.482082 0.454126
C  1.114987 2.509969 0.228858
C  -2.291297 1.575657 1.716703
C  1.952335 1.708923 1.008549
C  0.052303 0.860614 2.194535
C  -3.003119 0.662897 0.728551
C  1.42038 0.884162 1.992288
C  -1.140712 3.346531 -0.413199
C  1.675121 3.384974 -0.855886
C  4.063063 0.623775 0.675938
C  4.003133 0.064846 -0.737425
C  -5.187921 0.018034 0.054036
C  1.935242 -1.25414 -0.693945
C  0.573951 -1.436152 -1.024096
C  -0.117421 -2.482509 -0.453654
C  -1.554899 -2.771045 -0.753144
C  -5.231604 -1.470812 0.342783
C  -1.706092 -3.6639 -1.983014
C  1.776451 -3.089354 0.629897
H  -2.748404 2.567586 1.685482
H  -2.452207 1.194962 2.728212
H  -0.353172 0.217561 2.967144
H  -2.63389 -0.36269 0.858823
H  -2.767005 0.957031 -0.30408
H  2.06245 0.272361 2.613234
H  -0.833224 4.39375 -0.370464
H  -1.075637 3.045562 -1.461858
H  -2.191478 3.31119 -0.136545
H  1.232364 3.147047 -1.8260
H  1.463067 4.44038 -0.668928
H  2.752976 3.287995 -0.955455
H  5.096723 0.894906 0.897728
H  3.76733 -0.13557 1.402313
H  4.641286 -0.819204 -0.784341
H  4.411768 0.790278 -1.43973
H  2.205466 0.436506 -1.762606
H  -4.855797 0.188816 -0.979211
H  -6.196022 0.431956 0.133784
H  -2.113137 -1.84628 -0.899871
H  -1.982955 -3.272394 0.11552
H  -5.932016 -1.95579 -0.339203
H  -4.26173 -1.951494 0.207656
H  -5.571569 -1.666184 1.361336
H  -1.312588 -3.18498 -2.87987
H  -1.183854 -4.611641 -1.849627
H  -2.758315 -3.885923 -2.160606
H  2.275437 -3.774379 1.307081
elementType: Cl O N C H
totalener: -1554.03704999 hartree
nucrepener: 2722.84876399 hartree
electener: -4276.88581397 hartree
oneelecener: -7537.50292926 hartree
twoeener: 3260.61711529 hartree
cpcmener: -0.02691597 hartree
kineticenergy: 1548.40105461 hartree
xcener: -128.881708764572 hartree
chargesum: 0.0000000
charge: -0.100974 -0.371086 -0.385015 -0.177727 -0.402187 -0.402455 0.147869 -0.185682 -0.006346 -0.066598 0.185437 -0.269093 -0.002449 -0.128587 -0.313543 -0.272507 0.029175 -0.047868 0.058700 0.287399 -0.106508 0.257963 -0.131885 -0.252400 -0.256196 0.149036 0.086867 0.087460 0.130005 0.081846 0.075328 0.141897 0.111933 0.103881 0.095757 0.096863 0.113799 0.096973 0.108211 0.095157 0.097914 0.113436 0.174656 0.061303 0.091305 0.054800 0.092525 0.089604 0.067908 0.086097 0.085548 0.095769 0.095566 0.131122
qa: -0.1010 -0.3711 -0.3850 -0.1777 -0.4022 -0.4025 0.1479 -0.1857 -0.0063 -0.0666 0.1854 -0.2691 -0.0024 -0.1286 -0.3135 -0.2725 0.0292 -0.0479 0.0587 0.2874 -0.1065 0.2580 -0.1319 -0.2524 -0.2562 0.1490 0.0869 0.0875 0.1300 0.0818 0.0753 0.1419 0.1119 0.1039 0.0958 0.0969 0.1138 0.0970 0.1082 0.0952 0.0979 0.1134 0.1747 0.0613 0.0913 0.0548 0.0925 0.0896 0.0679 0.0861 0.0855 0.0958 0.0956 0.1311
va: 1.2333 2.0172 1.9404 3.2262 2.9589 3.0141 3.4185 3.7275 3.6697 3.7478 3.7671 3.9275 3.9606 3.7979 3.9155 3.8976 3.8232 3.8481 3.9027 4.0358 3.8732 3.7505 3.9027 3.8980 3.9303 4.1288 1.0133 1.0144 1.0073 0.9789 0.9912 0.9990 0.9989 0.9954 1.0064 0.9959 1.0000 1.0250 1.0070 1.0139 1.0255 1.0005 1.0243 0.9994 0.9906 1.0113 1.0164 1.0120 0.9982 1.0101 1.0057 1.0061 1.0041 0.9954
dispcorr: -0.034062599 hartree
energy: -1554.071112585486
dipole: -19.80110 20.22366 0.42256 2.81584 -2.53514 0.28070 0.79530 -2.24379 -1.44849
magnitude: 1.53476 au
magnitude: 3.90104 debye
