program: Orca
programVersion: 5.0.2
elementType: Cl O O N N N C C C C C C C C C C C C C C C C C C C C H H H H H H H H H H H H H H H H H H H H H H H H H H H H
charge: 0
multiplicity: 1
keywords: wb97x-d3
keywords: def2-TZVPP
keywords: def2/J RIJCOSX
keywords: DEFGRID2
keywords: scfconv7
keywords: smallprint printgap noloewdin
keywords: NOSOSCF
formula: C20H28ClN3O2
InChI: InChI=1/C20H28ClN3O2/c1-5-17-19(21)20(24-13-23-17)22-10-12-26-18-8-7-16(9-11-25-6-2)14(3)15(18)4/h7-8,13,22H,5-6,9-12H2,1-4H3
54 atoms
Cl -0.474151 -0.435088 -1.988733
O  3.297777 1.912941 0.63199
O  -4.265353 0.521405 1.267833
N  2.445788 -0.165227 -1.314086
N  2.548114 -2.066335 -0.030566
N  0.656344 -3.431721 0.343478
C  -0.741371 1.661338 1.603045
C  -0.295712 2.558697 0.62392
C  1.065224 2.618114 0.281773
C  -2.196665 1.495965 1.954877
C  1.974953 1.789358 0.942746
C  0.193547 0.847518 2.235568
C  -2.900201 0.61393 0.934394
C  1.539099 0.908371 1.925033
C  -1.248476 3.454595 -0.11538
C  1.520046 3.548582 -0.805586
C  4.048439 0.738077 0.372691
C  3.815708 0.196081 -1.028868
C  -4.969361 -0.475959 0.560166
C  1.83141 -1.228389 -0.780807
C  0.460504 -1.497769 -0.990193
C  -0.097517 -2.615498 -0.409231
C  -1.523724 -3.020466 -0.614805
C  -5.119043 -0.20375 -0.925146
C  -1.672308 -3.875731 -1.872067
C  1.925477 -3.110901 0.481606
H  -2.705537 2.460614 2.020528
H  -2.279525 1.034173 2.941517
H  -0.138145 0.151622 2.997567
H  -2.432762 -0.381778 0.935749
H  -2.762689 1.026931 -0.072958
H  2.237504 0.274431 2.456301
H  -1.328332 3.167539 -1.167021
H  -2.254296 3.439055 0.29707
H  -0.912411 4.493214 -0.101173
H  0.94042 3.402285 -1.719479
H  1.391267 4.595807 -0.520783
H  2.56777 3.412032 -1.059558
H  5.098266 1.022802 0.460557
H  3.861887 -0.036721 1.118781
H  4.470407 -0.665569 -1.172373
H  4.105559 0.94235 -1.768254
H  1.884994 0.513275 -1.802964
H  -5.957907 -0.529659 1.021805
H  -4.493949 -1.455698 0.709678
H  -2.174899 -2.147929 -0.680169
H  -1.840496 -3.594633 0.256547
H  -4.167495 -0.236576 -1.457751
H  -5.763903 -0.963612 -1.369639
H  -5.578297 0.769362 -1.107653
H  -1.048117 -4.76824 -1.818287
H  -2.706368 -4.19966 -1.992271
H  -1.390952 -3.323119 -2.768928
H  2.53294 -3.779212 1.082655
elementType: Cl O N C H
totalener: -1554.03757554 hartree
nucrepener: 2720.10271029 hartree
electener: -4274.14028582 hartree
oneelecener: -7531.93496868 hartree
twoeener: 3257.79468286 hartree
cpcmener: -0.02691465 hartree
kineticenergy: 1548.39659685 hartree
xcener: -128.880705368528 hartree
chargesum: 0.0000000
charge: -0.101842 -0.369352 -0.383761 -0.171051 -0.404072 -0.401746 0.146014 -0.183196 0.002762 -0.064421 0.173315 -0.277081 0.016560 -0.121984 -0.322376 -0.272529 0.026486 -0.047100 0.033921 0.286848 -0.111984 0.234720 -0.073538 -0.253976 -0.259541 0.150630 0.088753 0.083912 0.129518 0.067036 0.076541 0.142540 0.107017 0.099537 0.112289 0.098281 0.114147 0.095868 0.108671 0.095649 0.097972 0.114423 0.173505 0.096765 0.066884 0.030201 0.087314 0.076322 0.092513 0.087868 0.094977 0.095598 0.083957 0.130235
qa: -0.1018 -0.3694 -0.3838 -0.1711 -0.4041 -0.4017 0.1460 -0.1832 0.0028 -0.0644 0.1733 -0.2771 0.0166 -0.1220 -0.3224 -0.2725 0.0265 -0.0471 0.0339 0.2868 -0.1120 0.2347 -0.0735 -0.2540 -0.2595 0.1506 0.0888 0.0839 0.1295 0.0670 0.0765 0.1425 0.1070 0.0995 0.1123 0.0983 0.1141 0.0959 0.1087 0.0956 0.0980 0.1144 0.1735 0.0968 0.0669 0.0302 0.0873 0.0763 0.0925 0.0879 0.0950 0.0956 0.0840 0.1302
va: 1.2322 2.0187 1.9488 3.2245 2.9532 3.0161 3.4363 3.7353 3.6594 3.7639 3.7987 3.9365 3.9627 3.7804 3.9193 3.9025 3.8265 3.8439 3.9169 4.0233 3.8617 3.7843 3.8968 3.8704 3.9305 4.1275 1.0126 1.0160 1.0075 0.9893 0.9776 0.9991 0.9941 1.0054 0.9983 0.9942 0.9985 1.0245 1.0070 1.0134 1.0266 0.9999 1.0243 0.9922 0.9978 1.0157 1.0244 1.0003 1.0111 1.0088 1.0065 1.0045 1.0061 0.9955
dispcorr: -0.033777809 hartree
energy: -1554.071353347534
dipole: -18.71381 19.01875 0.30494 4.81170 -4.53892 0.27277 -0.93302 -0.55060 -1.48362
magnitude: 1.53900 au
magnitude: 3.91183 debye
