program: Orca
programVersion: 5.0.2
elementType: Cl O O N N N C C C C C C C C C C C C C C C C C C C C H H H H H H H H H H H H H H H H H H H H H H H H H H H H
charge: 0
multiplicity: 1
keywords: wb97x-d3
keywords: def2-TZVPP
keywords: def2/J RIJCOSX
keywords: DEFGRID2
keywords: scfconv7
keywords: smallprint printgap noloewdin
keywords: NOSOSCF
formula: C20H28ClN3O2
InChI: InChI=1/C20H28ClN3O2/c1-5-17-19(21)20(24-13-23-17)22-10-12-26-18-8-7-16(9-11-25-6-2)14(3)15(18)4/h7-8,13,22H,5-6,9-12H2,1-4H3
54 atoms
Cl 0.082915 -1.278138 -2.358199
O  3.228284 2.203165 0.140879
O  -4.309397 0.408621 -0.313465
N  2.797772 -0.478569 -1.351353
N  2.506661 -1.356195 0.763711
N  0.470465 -2.360791 1.423163
C  -0.855225 1.526636 0.564387
C  0.009794 1.434127 1.664978
C  1.385902 1.654284 1.514445
C  -2.307694 1.149442 0.71571
C  1.88279 2.006113 0.254774
C  -0.331404 1.930481 -0.658095
C  -3.064272 1.001702 -0.591505
C  1.020285 2.181731 -0.816558
C  -0.538076 1.043732 3.009621
C  2.314311 1.49733 2.685717
C  3.911885 1.715649 -1.000287
C  4.037047 0.199677 -1.049821
C  -5.067042 0.145935 -1.4733
C  2.025824 -1.112438 -0.4568
C  0.717288 -1.538668 -0.768429
C  -0.045412 -2.149068 0.206609
C  -1.45658 -2.588507 -0.056597
C  -6.308743 -0.625462 -1.092185
C  -2.188612 -3.146279 1.149932
C  1.712871 -1.965114 1.620826
H  -2.827149 1.87493 1.351367
H  -2.367287 0.193593 1.246263
H  -0.972975 2.045033 -1.521997
H  -2.494391 0.374578 -1.292029
H  -3.20049 1.978183 -1.078115
H  1.388931 2.491622 -1.7859
H  -0.583865 -0.0431 3.124605
H  0.068395 1.425999 3.828422
H  -1.548388 1.421638 3.162765
H  3.358909 1.494628 2.386474
H  2.189294 2.309866 3.406187
H  2.130466 0.567187 3.224041
H  3.472775 2.089547 -1.93085
H  4.916327 2.136997 -0.936441
H  4.434341 -0.181132 -0.111207
H  4.764866 -0.040567 -1.828513
H  2.384723 -0.263684 -2.245179
H  -4.473563 -0.434979 -2.193215
H  -5.341508 1.083357 -1.976894
H  -1.442215 -3.333297 -0.858669
H  -2.017038 -1.743669 -0.46555
H  -6.904774 -0.829317 -1.982084
H  -6.056998 -1.583092 -0.633677
H  -6.932788 -0.064508 -0.395003
H  -2.243581 -2.424429 1.964667
H  -3.210169 -3.402175 0.867774
H  -1.715888 -4.048398 1.536553
H  2.130472 -2.156386 2.603829
elementType: Cl O N C H
totalener: -1554.03415295 hartree
nucrepener: 2756.09356039 hartree
electener: -4310.12771334 hartree
oneelecener: -7604.76546664 hartree
twoeener: 3294.63775330 hartree
cpcmener: -0.02785461 hartree
kineticenergy: 1548.38884668 hartree
xcener: -128.885948668995 hartree
chargesum: 0.0000000
charge: -0.104353 -0.361343 -0.377041 -0.172426 -0.382773 -0.396231 0.032950 -0.140917 0.026756 -0.060438 0.259605 -0.215648 -0.007198 -0.199483 -0.309211 -0.286438 0.018050 -0.029590 0.049130 0.254066 -0.084070 0.221159 -0.108736 -0.255951 -0.263567 0.124682 0.097838 0.070556 0.121807 0.059807 0.106573 0.137636 0.098729 0.106953 0.110436 0.097161 0.113830 0.097680 0.093503 0.108243 0.099588 0.107177 0.161069 0.069000 0.077388 0.108244 0.080477 0.083632 0.082639 0.083571 0.080318 0.096091 0.085134 0.133933
qa: -0.1044 -0.3613 -0.3770 -0.1724 -0.3828 -0.3962 0.0330 -0.1409 0.0268 -0.0604 0.2596 -0.2156 -0.0072 -0.1995 -0.3092 -0.2864 0.0181 -0.0296 0.0491 0.2541 -0.0841 0.2212 -0.1087 -0.2560 -0.2636 0.1247 0.0978 0.0706 0.1218 0.0598 0.1066 0.1376 0.0987 0.1070 0.1104 0.0972 0.1138 0.0977 0.0935 0.1082 0.0996 0.1072 0.1611 0.0690 0.0774 0.1082 0.0805 0.0836 0.0826 0.0836 0.0803 0.0961 0.0851 0.1339
va: 1.2389 2.0320 1.9285 3.2191 2.9686 2.9427 3.5449 3.7355 3.6278 3.7674 3.6337 3.8505 3.9395 3.9088 3.9260 3.9181 3.8788 3.8344 3.8779 4.1661 3.9413 3.7506 3.9020 3.9652 3.9521 4.1123 1.0083 1.0063 1.0131 0.9938 0.9961 1.0056 1.0037 0.9989 0.9981 1.0230 0.9966 0.9902 0.9971 1.0057 1.0345 1.0079 1.0357 0.9856 0.9900 1.0052 0.9854 1.0082 1.0038 1.0044 1.0034 1.0050 1.0115 0.9958
dispcorr: -0.035831913 hartree
energy: -1554.069984866652
dipole: -22.12332 22.56373 0.44042 3.20390 -2.87053 0.33337 10.30504 -12.27206 -1.96703
magnitude: 2.04311 au
magnitude: 5.19317 debye
