program: Orca
programVersion: 5.0.2
elementType: Cl O O N N N C C C C C C C C C C C C C C C C C C C C H H H H H H H H H H H H H H H H H H H H H H H H H H H H
charge: 0
multiplicity: 1
keywords: wb97x-d3
keywords: def2-TZVPP
keywords: def2/J RIJCOSX
keywords: DEFGRID2
keywords: scfconv7
keywords: smallprint printgap noloewdin
keywords: NOSOSCF
formula: C20H28ClN3O2
InChI: InChI=1/C20H28ClN3O2/c1-5-17-19(21)20(24-13-23-17)22-10-12-26-18-8-7-16(9-11-25-6-2)14(3)15(18)4/h7-8,13,22H,5-6,9-12H2,1-4H3
54 atoms
Cl -0.14259 -0.258276 -2.225037
O  3.225186 1.647973 1.070186
O  -4.42251 0.790384 0.192647
N  2.696543 -0.094609 -1.298159
N  2.787275 -2.229711 -0.456333
N  0.914805 -3.668114 -0.492064
C  -0.914555 1.394172 1.434431
C  -0.30673 2.523955 0.869934
C  1.088682 2.582287 0.722647
C  -2.408917 1.240149 1.541307
C  1.873356 1.514679 1.170806
C  -0.101186 0.350567 1.864986
C  -3.016227 0.84281 0.19456
C  1.275645 0.401685 1.749892
C  -1.118916 3.692351 0.385765
C  1.720751 3.784978 0.081714
C  4.022916 0.530197 0.717622
C  3.999693 0.249832 -0.776607
C  -4.973239 -0.328106 0.85554
C  2.091602 -1.265406 -1.057996
C  0.744113 -1.506661 -1.414718
C  0.179021 -2.722381 -1.099077
C  -1.25606 -3.073464 -1.343465
C  -6.458675 -0.374602 0.582804
C  -2.014842 -3.21063 -0.026113
C  2.165336 -3.370054 -0.219028
H  -2.884829 2.158567 1.894195
H  -2.629832 0.4734 2.287699
H  -0.55524 -0.526875 2.311048
H  -2.592412 -0.119679 -0.123631
H  -2.738257 1.577529 -0.565309
H  1.866791 -0.426257 2.118816
H  -0.72779 4.635813 0.770615
H  -1.1010 3.769625 -0.704233
H  -2.162491 3.63461 0.685429
H  1.636166 4.670036 0.717503
H  2.777378 3.640406 -0.126586
H  1.233851 4.032529 -0.863169
H  5.043515 0.790486 1.002918
H  3.753043 -0.363631 1.283507
H  4.711501 -0.550053 -0.985736
H  4.339618 1.129768 -1.322593
H  2.138049 0.660883 -1.660657
H  -4.797774 -0.27807 1.937576
H  -4.49737 -1.253174 0.500877
H  -1.286546 -4.024975 -1.879201
H  -1.744894 -2.337535 -1.978937
H  -6.666075 -0.479721 -0.483162
H  -6.902847 -1.228676 1.094919
H  -6.959981 0.525116 0.942865
H  -3.058981 -3.461983 -0.213219
H  -1.587447 -3.99773 0.594702
H  -1.990502 -2.281905 0.545412
H  2.757387 -4.144178 0.257604
elementType: Cl O N C H
totalener: -1554.03699513 hartree
nucrepener: 2691.33005170 hartree
electener: -4245.36704684 hartree
oneelecener: -7474.39902186 hartree
twoeener: 3229.03197503 hartree
cpcmener: -0.02629819 hartree
kineticenergy: 1548.39539300 hartree
xcener: -128.881394090090 hartree
chargesum: -0.0000000
charge: -0.098363 -0.361592 -0.387598 -0.175003 -0.404957 -0.409400 0.151152 -0.162026 0.027071 -0.098759 0.129027 -0.302569 0.031704 -0.097782 -0.324697 -0.277703 0.015433 -0.026441 0.066332 0.285931 -0.114618 0.236657 -0.106512 -0.254778 -0.258918 0.145870 0.092417 0.092379 0.132226 0.040403 0.107152 0.143291 0.109696 0.112370 0.099113 0.109928 0.094806 0.101279 0.109491 0.098786 0.095578 0.111952 0.170735 0.071370 0.063747 0.091950 0.081448 0.081280 0.082331 0.085425 0.101280 0.100872 0.060577 0.130655
qa: -0.0984 -0.3616 -0.3876 -0.1750 -0.4050 -0.4094 0.1512 -0.1620 0.0271 -0.0988 0.1290 -0.3026 0.0317 -0.0978 -0.3247 -0.2777 0.0154 -0.0264 0.0663 0.2859 -0.1146 0.2367 -0.1065 -0.2548 -0.2589 0.1459 0.0924 0.0924 0.1322 0.0404 0.1072 0.1433 0.1097 0.1124 0.0991 0.1099 0.0948 0.1013 0.1095 0.0988 0.0956 0.1120 0.1707 0.0714 0.0637 0.0920 0.0814 0.0813 0.0823 0.0854 0.1013 0.1009 0.0606 0.1307
va: 1.2388 2.0297 1.9508 3.2272 2.9625 3.0081 3.3861 3.7754 3.6493 3.7049 3.8322 3.9446 3.9790 3.7365 3.9213 3.9056 3.8414 3.8446 3.8881 4.0509 3.8967 3.7676 3.8956 3.9594 3.9004 4.1300 1.0111 1.0046 1.0044 1.0096 0.9995 1.0011 0.9970 0.9919 1.0068 0.9964 1.0238 0.9937 1.0065 1.0096 1.0284 1.0016 1.0291 0.9820 0.9839 1.0214 1.0201 1.0063 1.0078 1.0050 1.0029 1.0209 1.0062 0.9946
dispcorr: -0.033018544 hartree
energy: -1554.070013677800
dipole: -22.87267 23.31352 0.44085 6.76382 -6.34599 0.41782 11.00784 -11.25346 -0.24562
magnitude: 0.65518 au
magnitude: 1.66533 debye
