program: Orca
programVersion: 5.0.2
elementType: Cl O O N N N C C C C C C C C C C C C C C C C C C C C H H H H H H H H H H H H H H H H H H H H H H H H H H H H
charge: 0
multiplicity: 1
keywords: wb97x-d3
keywords: def2-TZVPP
keywords: def2/J RIJCOSX
keywords: DEFGRID2
keywords: scfconv7
keywords: smallprint printgap noloewdin
keywords: NOSOSCF
formula: C20H28ClN3O2
InChI: InChI=1/C20H28ClN3O2/c1-5-17-19(21)20(24-13-23-17)22-10-12-26-18-8-7-16(9-11-25-6-2)14(3)15(18)4/h7-8,13,22H,5-6,9-12H2,1-4H3
54 atoms
Cl 0.915243 -2.166437 -2.271333
O  2.58272 2.105559 0.142279
O  -5.084725 1.227259 -0.055389
N  3.171287 -0.436233 -1.306267
N  3.085587 -1.170412 0.877426
N  1.494969 -2.761006 1.600947
C  -1.382846 0.858695 -0.083996
C  -0.707125 0.915532 1.142505
C  0.635777 1.321724 1.197389
C  -2.832279 0.466835 -0.207893
C  1.297107 1.679478 0.016141
C  -0.692962 1.220527 -1.235132
C  -3.747093 1.647086 0.082372
C  0.626797 1.630768 -1.200204
C  -1.383213 0.533135 2.429557
C  1.340572 1.38782 2.522896
C  3.497048 1.995892 -0.9321
C  4.123114 0.613412 -1.031055
C  -6.039798 2.17064 0.378759
C  2.611411 -1.213835 -0.367514
C  1.538632 -2.086396 -0.657742
C  0.999007 -2.846694 0.357574
C  -0.173137 -3.757601 0.162594
C  -6.144353 3.401565 -0.502018
C  -1.492711 -2.998461 0.285904
C  2.507926 -1.938556 1.780094
H  -3.084249 -0.363924 0.454709
H  -3.021611 0.11683 -1.225919
H  -1.201891 1.183717 -2.191476
H  -3.507254 2.465274 -0.609306
H  -3.564294 2.028519 1.097898
H  1.109355 1.907201 -2.127647
H  -2.430778 0.27454 2.300517
H  -0.895008 -0.327806 2.893153
H  -1.341769 1.343745 3.160093
H  0.965645 2.217351 3.128596
H  1.181061 0.480517 3.10652
H  2.413688 1.522145 2.421605
H  3.052153 2.288336 -1.886245
H  4.290588 2.715765 -0.724454
H  4.656669 0.375613 -0.113335
H  4.86018 0.638063 -1.836406
H  2.749843 -0.43237 -2.221693
H  -5.833441 2.473761 1.414784
H  -6.997687 1.645568 0.386824
H  -0.125481 -4.532955 0.927904
H  -0.121286 -4.256741 -0.805861
H  -6.975645 4.021946 -0.163368
H  -5.246033 4.019241 -0.469029
H  -6.334856 3.129745 -1.541725
H  -2.336003 -3.682166 0.186341
H  -1.574544 -2.509435 1.257451
H  -1.589987 -2.236331 -0.486965
H  2.91466 -1.880779 2.784133
elementType: Cl O N C H
totalener: -1554.03671751 hartree
nucrepener: 2689.96717111 hartree
electener: -4244.00388861 hartree
oneelecener: -7472.75891851 hartree
twoeener: 3228.75502990 hartree
cpcmener: -0.02909287 hartree
kineticenergy: 1548.39506901 hartree
xcener: -128.883192392065 hartree
chargesum: -0.0000000
charge: -0.101099 -0.349641 -0.379837 -0.186065 -0.387545 -0.393439 0.092586 -0.155398 0.021070 -0.079138 0.254388 -0.233154 -0.006066 -0.200739 -0.342164 -0.299224 0.003184 -0.012063 0.041586 0.291655 -0.129629 0.238641 -0.104314 -0.260329 -0.276916 0.137576 0.075528 0.090715 0.128809 0.088911 0.084562 0.138543 0.098898 0.104922 0.121453 0.118810 0.100008 0.098223 0.098759 0.109137 0.098802 0.106503 0.165361 0.065832 0.090294 0.080370 0.080848 0.090715 0.086638 0.081982 0.105398 0.094057 0.077218 0.134775
qa: -0.1011 -0.3496 -0.3798 -0.1861 -0.3875 -0.3934 0.0926 -0.1554 0.0211 -0.0791 0.2544 -0.2332 -0.0061 -0.2007 -0.3422 -0.2992 0.0032 -0.0121 0.0416 0.2917 -0.1296 0.2386 -0.1043 -0.2603 -0.2769 0.1376 0.0755 0.0907 0.1288 0.0889 0.0846 0.1385 0.0989 0.1049 0.1215 0.1188 0.1000 0.0982 0.0988 0.1091 0.0988 0.1065 0.1654 0.0658 0.0903 0.0804 0.0808 0.0907 0.0866 0.0820 0.1054 0.0941 0.0772 0.1348
va: 1.2331 2.0482 1.9388 3.2392 2.9598 2.9976 3.4003 3.6627 3.6172 3.7380 3.6384 3.9429 3.9745 3.8402 3.9298 3.9054 3.8947 3.8222 3.9208 4.0775 3.8788 3.7665 3.8876 3.8787 3.9430 4.1063 1.0186 1.0140 1.0060 0.9880 0.9871 1.0067 1.0013 1.0005 0.9933 0.9973 0.9910 1.0253 0.9955 1.0039 1.0336 1.0088 1.0324 0.9992 0.9912 1.0254 1.0137 1.0104 1.0000 1.0077 1.0087 0.9958 1.0015 0.9966
dispcorr: -0.033897364 hartree
energy: -1554.070614871216
dipole: -27.98987 28.41414 0.42427 17.30488 -16.15524 1.14964 11.86252 -13.06345 -1.20094
magnitude: 1.71578 au
magnitude: 4.36118 debye
