program: Orca
programVersion: 5.0.2
elementType: Cl O O N N N C C C C C C C C C C C C C C C C C C C C H H H H H H H H H H H H H H H H H H H H H H H H H H H H
charge: 0
multiplicity: 1
keywords: wb97x-d3
keywords: def2-TZVPP
keywords: def2/J RIJCOSX
keywords: DEFGRID2
keywords: scfconv7
keywords: smallprint printgap noloewdin
keywords: NOSOSCF
formula: C20H28ClN3O2
InChI: InChI=1/C20H28ClN3O2/c1-5-17-19(21)20(24-13-23-17)22-10-12-26-18-8-7-16(9-11-25-6-2)14(3)15(18)4/h7-8,13,22H,5-6,9-12H2,1-4H3
54 atoms
Cl -0.527591 -0.422536 -1.865864
O  3.253533 1.816719 0.668836
O  -4.359086 0.63227 1.191756
N  2.438935 -0.14161 -1.439299
N  2.701543 -2.185409 -0.422382
N  0.870318 -3.609254 0.025692
C  -0.782381 1.548284 1.655364
C  -0.290597 2.631612 0.915675
C  1.068044 2.69439 0.564571
C  -2.24071 1.383093 1.995147
C  1.934795 1.678446 0.979922
C  0.109284 0.556005 2.050057
C  -3.010314 0.796881 0.820957
C  1.453251 0.612261 1.731404
C  -1.191732 3.740809 0.451297
C  1.570523 3.847848 -0.256889
C  4.020209 0.679899 0.306364
C  3.793682 0.264689 -1.138772
C  -5.224606 0.325603 0.120402
C  1.899088 -1.283648 -0.989101
C  0.518199 -1.561365 -1.086676
C  0.030008 -2.726925 -0.535776
C  -1.424459 -3.083116 -0.533112
C  -4.967822 -1.0196 -0.533976
C  -1.879018 -3.703906 -1.851873
C  2.148535 -3.293087 0.033147
H  -2.694827 2.330031 2.296069
H  -2.334791 0.708925 2.850184
H  -0.255925 -0.285287 2.628072
H  -2.554393 -0.160889 0.540536
H  -2.927108 1.456127 -0.055558
H  2.11004 -0.174434 2.078894
H  -2.192027 3.679114 0.87242
H  -0.790237 4.719683 0.720502
H  -1.300466 3.738301 -0.636181
H  0.955193 3.998974 -1.145739
H  1.541139 4.784854 0.305111
H  2.59452 3.707098 -0.592291
H  5.064373 0.976583 0.418419
H  3.854203 -0.161273 0.982097
H  4.488624 -0.542383 -1.375065
H  4.032095 1.095378 -1.803009
H  1.813186 0.578306 -1.763188
H  -5.183271 1.117529 -0.640877
H  -6.233317 0.340597 0.539173
H  -2.029614 -2.201732 -0.312089
H  -1.588023 -3.793601 0.277919
H  -4.96429 -1.826548 0.200967
H  -5.763045 -1.228549 -1.25157
H  -4.024443 -1.049261 -1.081616
H  -1.307205 -4.603615 -2.083101
H  -2.930986 -3.985331 -1.790689
H  -1.770616 -3.012256 -2.687556
H  2.825391 -4.015557 0.476829
elementType: Cl O N C H
totalener: -1554.03723702 hartree
nucrepener: 2705.76969106 hartree
electener: -4259.80692808 hartree
oneelecener: -7503.23870139 hartree
twoeener: 3243.43177330 hartree
cpcmener: -0.02652202 hartree
kineticenergy: 1548.38351205 hartree
xcener: -128.878961539543 hartree
chargesum: 0.0000000
charge: -0.100315 -0.362067 -0.381769 -0.177072 -0.404168 -0.399780 0.142193 -0.163475 0.023514 -0.071002 0.116929 -0.294986 0.041819 -0.085468 -0.324412 -0.274889 0.014892 -0.023984 0.042544 0.269692 -0.103778 0.227519 -0.056781 -0.260582 -0.273927 0.151467 0.088157 0.085351 0.130655 0.034446 0.082640 0.143988 0.099167 0.110653 0.111164 0.100297 0.109590 0.094714 0.109539 0.099675 0.094853 0.110830 0.169976 0.065840 0.092018 0.038161 0.083644 0.086977 0.097736 0.075160 0.099317 0.096569 0.084703 0.132065
qa: -0.1003 -0.3621 -0.3818 -0.1771 -0.4042 -0.3998 0.1422 -0.1635 0.0235 -0.0710 0.1169 -0.2950 0.0418 -0.0855 -0.3244 -0.2749 0.0149 -0.0240 0.0425 0.2697 -0.1038 0.2275 -0.0568 -0.2606 -0.2739 0.1515 0.0882 0.0854 0.1307 0.0344 0.0826 0.1440 0.0992 0.1107 0.1112 0.1003 0.1096 0.0947 0.1095 0.0997 0.0949 0.1108 0.1700 0.0658 0.0920 0.0382 0.0836 0.0870 0.0977 0.0752 0.0993 0.0966 0.0847 0.1321
va: 1.2365 2.0292 1.9577 3.2298 2.9632 3.0189 3.4301 3.7496 3.6575 3.7621 3.8356 3.9522 3.9821 3.7162 3.9212 3.9045 3.8401 3.8485 3.9222 4.0684 3.8791 3.7918 3.9051 3.8741 3.9190 4.1213 1.0115 1.0164 1.0070 0.9633 0.9874 0.9998 1.0055 0.9972 0.9921 0.9942 0.9968 1.0241 1.0064 1.0091 1.0282 1.0021 1.0285 0.9989 0.9912 1.0034 1.0335 1.0067 1.0115 0.9942 1.0057 1.0031 1.0086 0.9954
dispcorr: -0.033394362 hartree
energy: -1554.070631383244
dipole: -19.27262 19.43980 0.16719 6.61692 -5.84832 0.76860 1.12603 -2.51125 -1.38522
magnitude: 1.59296 au
magnitude: 4.04899 debye
