program: Gaussian 09
title: 000054901
version: EM64L-G09RevD.01
frameworkgroup: C1[X(C23H22ClF3O2)]
method: RPBEPBE
basis: SDD
operation: Freq
keyword: #p
keyword: freq=noraman
keyword: PBEPBE/SDD
title: #p freq=noraman PBEPBE/SDD
converged: YES YES NO NO
title: Mulliken charges:
elementType: Cl F F F O O C C C C C C C C C C C C C C C C C C C C C C C H H H H H H H H H H H H H H H H H H H H H H
charge: -0.004415 -0.151602 -0.163255 -0.150106 -0.271714 -0.259788 0.314324 -0.268754 -0.378654 -0.723362 -0.737558 0.016486 0.266635 -0.268475 -0.484335 0.368343 0.400082 0.099955 -0.435540 0.231319 -0.853167 -0.246326 -0.399624 0.288087 -0.381281 -0.409651 -0.235812 -0.229117 -0.242591 0.292642 0.277075 0.231282 0.228038 0.211068 0.212877 0.266893 0.219961 0.239203 0.249152 0.235266 0.238661 0.228043 0.258401 0.259441 0.231804 0.253003 0.242598 0.248775 0.227770 0.227245 0.230699
chargesum: 0.00000
title: Mulliken charges with hydrogens summed into heavy atoms:
elementType: Cl F F F O O C C C C C C C C C C C C C C C C C C C C C C C
charge: -0.004415 -0.151602 -0.163255 -0.150106 -0.271714 -0.259788 0.314324 0.023888 -0.101579 -0.052974 -0.037827 0.255690 0.266635 -0.268475 0.000083 0.368343 0.400082 0.099955 -0.196879 0.231319 -0.107281 -0.014521 -0.146622 0.288087 -0.138683 -0.160877 -0.008042 -0.001872 -0.011892
polarizability: 3.61060084e+02 1.51402113e+01 2.51469262e+02 5.35213827e+01 7.58360896e+00 2.29166459e+02
1716.lowfreq: -6.5985 -2.2162 0.0010 0.0011 0.0012 2.9803 6.1651 13.4444 19.8675
frequency: -1.8713 13.3987 19.8463 22.0335 36.3811 41.8739 60.5122 63.7164 69.4170 82.2778 92.7820 116.3009 133.1513 152.0161 157.7286 165.5144 170.4047 185.0370 194.4478 203.3722 217.4029 238.2962 246.6037 268.5513 283.5415 290.7442 322.7853 326.1258 333.8852 337.5636 359.0806 375.0908 406.0267 410.3038 427.7138 432.6532 454.7615 489.3691 504.9158 510.2177 522.5417 541.6114 575.7795 583.5608 595.0857 608.7731 620.2360 631.9769 655.8767 665.1775 706.9507 715.9203 725.2284 740.4061 764.9618 790.0870 799.2731 804.8177 846.2728 854.1334 858.1123 874.8022 895.7426 908.2355 917.4994 927.9944 947.2516 959.6344 966.3757 975.8313 980.8759 987.9521 990.4715 994.7319 996.6173 997.6434 1016.3047 1020.1984 1033.0165 1043.1388 1051.3162 1076.4219 1081.4808 1088.4738 1114.5019 1120.0475 1127.3343 1171.3175 1172.7928 1183.8357 1190.3457 1193.2448 1208.2564 1208.6148 1241.9649 1263.0994 1279.9113 1286.6997 1291.9155 1314.6583 1337.9091 1358.7054 1364.9223 1371.2351 1393.4071 1401.2054 1404.3305 1419.0559 1426.9325 1446.5860 1453.9884 1464.4225 1468.0694 1471.3094 1479.8804 1485.3974 1487.3979 1491.2210 1493.2776 1581.0891 1594.6231 1600.9291 1611.6019 1619.1050 1658.4778 2974.3223 2981.1583 2983.5462 3021.2069 3060.5308 3067.2800 3075.2319 3083.0813 3085.2072 3103.5026 3106.1280 3122.5204 3124.2279 3125.7051 3127.2437 3135.0947 3136.7235 3140.4620 3148.8283 3153.7827 3160.1743 3164.8383
redmass: 6.4106 6.2922 7.0713 10.0138 4.8659 13.7942 4.5878 7.2418 4.0932 5.3399 4.6571 4.9376 4.5611 1.8697 4.3888 1.8350 1.9793 4.7467 2.0961 2.1109 3.4052 2.0170 3.4757 3.6096 5.0692 5.0822 3.9709 4.1588 3.0670 5.8272 3.6083 2.8038 2.9824 5.1834 3.6102 4.2769 3.8464 11.1536 3.2459 3.5235 3.6970 3.8567 8.5795 5.9981 8.9251 5.8361 5.8236 4.9349 6.5095 5.8231 1.7457 4.9985 4.1928 2.5712 1.8550 3.9960 4.2710 2.3001 5.6382 1.2676 3.8805 3.5824 1.5985 3.7457 1.4449 1.4711 2.2504 1.5841 1.6186 1.3901 1.3761 4.6046 1.7005 1.3683 2.4116 9.8767 2.6007 2.2917 1.8722 1.5474 1.9417 1.8477 1.3579 1.9344 2.0844 1.9641 1.8820 3.5089 1.0526 1.4330 1.1213 1.2366 2.2209 2.0662 3.6342 1.5872 1.5436 1.7450 2.5264 1.4370 1.5530 1.7028 5.5375 7.1076 1.2393 1.2323 1.3902 2.0626 2.3915 1.9330 2.9611 1.0520 1.2127 1.0504 1.0933 1.1059 1.4858 1.0686 1.5646 5.7674 6.6788 6.3201 6.1448 9.8726 8.3949 1.0437 1.0368 1.0366 1.0582 1.0907 1.0989 1.0990 1.0993 1.1068 1.0991 1.0983 1.0846 1.0866 1.0902 1.0875 1.0911 1.0880 1.0921 1.0965 1.0890 1.0995 1.1016
irintensity: 0.2934 0.0870 0.1836 0.0375 0.3390 0.2052 0.5062 1.4280 0.3067 0.1965 0.4705 0.6672 0.4012 1.0547 0.1813 0.1345 0.5578 1.6612 1.3981 1.3126 1.9802 0.0618 10.8795 4.1501 5.1215 2.0962 7.4018 0.4916 4.0165 1.6730 2.6296 0.7797 0.1409 4.5679 12.3406 5.7717 3.8827 1.2330 3.5104 1.3939 2.4169 20.5675 4.3816 8.7181 11.3845 5.2898 0.8509 0.6108 11.6652 9.0723 53.4787 3.3312 23.4846 22.7370 96.1631 75.8837 4.1612 21.0452 52.4575 0.6238 31.0339 18.1902 55.8072 59.4917 1.3675 3.5435 35.0648 8.0617 21.3328 0.9291 0.5234 2.2430 59.9011 2.5663 26.4700 233.5157 120.5769 85.2829 4.1689 8.0021 131.9235 10.1375 93.1820 2.8385 489.5995 31.8450 97.1291 221.6838 0.0524 2.9500 1.1251 11.0157 149.6680 46.6593 102.8171 3.4582 40.3008 14.4067 3.7416 1.5679 71.9635 8.0958 3.5006 0.1246 33.5431 6.1542 51.2368 62.8198 10.7047 7.6032 9.0881 13.1215 27.8506 7.0693 6.4112 14.1722 3.0949 14.8901 6.4679 1.7861 1.6076 4.3622 6.4099 163.9927 94.7760 18.2799 20.6843 40.0446 17.0983 10.3906 15.1518 35.5271 29.5659 11.5072 5.8835 9.8157 4.9626 2.8214 2.6310 0.7641 20.7601 2.8105 11.7705 37.2229 1.5519 25.9099 23.7807
temp: 298.150 k
press: 1.00000 atm
elementType: 17 9 9 9 8 8 6 6 6 6 6 6 6 6 6 6 6 6 6 6 6 6 6 6 6 6 6 6 6 1 1 1 1 1 1 1 1 1 1 1 1 1 1 1 1 1 1 1 1 1 1
symmnumber: 1
zpe: 1022143.5 jmol-1
zpe.correction: 0.389314 hartree
zpe.thermalcorrener: 0.417131 hartree
zpe.thermalcorrenthalpy: 0.418075 hartree
zpe.thermalcorrgfe: 0.327854 hartree
zpe.sumelectzpe: -1797.548532 hartree
zpe.sumelectthermal: -1797.520714 hartree
zpe.sumelectthermalent: -1797.519770 hartree
zpe.sumelectthermalfe: -1797.609991 hartree
dipole: 4.8906 2.6601 1.6104
dipole: 5.7955
quadrupole: -193.4153 -168.8327 -175.0420
quadrupole: -12.4214 2.9979 6.5227
quadrupole: -14.3186 10.2639 4.0547 -12.4214 2.9979 6.5227
hfenergy: -1797.9378455 hartree
pointgroup: C01 [X(C23H22Cl1F3O2)]
dipole: -1.8450741 1.2128089 0.5689789 debye
polarizability: 354.2144899|-60.2795945|249.5211299|15.2098482|12.986613|237.9601857 unknown
InChI: InChI=1S/C23H22ClF3O2/c1-14-16(10-7-11-17(14)15-8-5-4-6-9-15)13-29-21(28)20-18(22(20,2)3)12-19(24)23(25,26)27/h4-12,18,20H,13H2,1-3H3
charge 0 multiplicity 1
51 atoms
Cl 6.037721 -1.97959 0.226399
F  7.632448 -0.317368 -1.940005
F  5.777624 0.466431 -2.991231
F  6.196148 -1.765048 -2.914881
O  -0.058604 -0.506938 0.704074
O  1.474216 -1.150373 2.347481
C  3.055488 1.430974 1.308514
C  3.640671 0.146697 0.665856
C  2.104869 0.441554 0.585847
C  3.266995 2.781613 0.624015
C  3.074752 1.499701 2.834003
C  4.440069 0.173307 -0.567515
C  1.193526 -0.477244 1.323604
C  5.470121 -0.65526 -0.87539
C  -1.077748 -1.428667 1.33846
C  6.253785 -0.572812 -2.15154
C  -2.234872 -1.574393 0.38175
C  -3.23672 -0.560566 0.274634
C  -2.307292 -2.746163 -0.408068
C  -4.324954 -0.761571 -0.631561
C  -3.090784 0.719379 1.086095
C  -3.365766 -2.929705 -1.321397
C  -4.363735 -1.941932 -1.425365
C  -5.447101 0.218874 -0.788729
C  -6.187402 0.691129 0.32947
C  -5.834446 0.657841 -2.08442
C  -7.274387 1.575882 0.159064
C  -6.91829 1.546726 -2.257017
C  -7.643937 2.010122 -1.135274
H  3.892041 -0.641854 1.383596
H  1.709125 0.775567 -0.377304
H  2.520387 3.508892 0.991592
H  4.272196 3.179174 0.856741
H  3.164752 2.73151 -0.474059
H  2.303384 2.204705 3.197277
H  2.883946 0.516503 3.293423
H  4.058896 1.865868 3.179775
H  4.195037 0.931959 -1.322386
H  -0.579379 -2.392523 1.53779
H  -1.361428 -0.978152 2.305517
H  -1.526713 -3.509982 -0.309621
H  -3.398413 0.57535 2.140987
H  -2.040469 1.05736 1.091655
H  -3.709255 1.531538 0.673901
H  -3.419883 -3.835604 -1.934136
H  -5.207833 -2.089303 -2.108506
H  -5.925463 0.341315 1.334371
H  -5.266742 0.314489 -2.957151
H  -7.836979 1.919358 1.034535
H  -7.193099 1.879799 -3.264196
H  -8.486401 2.69803 -1.267573
