program: Orca
programVersion: 5.0.2
elementType: Cl O O N N N C C C C C C C C C C C C C C C C C C C C H H H H H H H H H H H H H H H H H H H H H H H H H H H H
charge: 0
multiplicity: 1
keywords: wb97x-d3
keywords: def2-TZVPP
keywords: def2/J RIJCOSX
keywords: DEFGRID2
keywords: scfconv7
keywords: smallprint printgap noloewdin
keywords: NOSOSCF
formula: C20H28ClN3O2
InChI: InChI=1/C20H28ClN3O2/c1-5-17-19(21)20(24-13-23-17)22-10-12-26-18-8-7-16(9-11-25-6-2)14(3)15(18)4/h7-8,13,22H,5-6,9-12H2,1-4H3
54 atoms
Cl 0.149816 -1.155066 -2.488399
O  3.140492 1.796503 0.578927
O  -4.393723 0.755653 -0.663146
N  2.826525 -0.479207 -1.304664
N  2.446976 -1.546932 0.702697
N  0.398846 -2.621746 1.181445
C  -0.98619 2.123321 0.138684
C  -0.416228 1.67705 1.339391
C  0.97702 1.561527 1.465985
C  -2.472917 2.177981 -0.091923
C  1.797583 1.899985 0.383458
C  -0.138493 2.460241 -0.909727
C  -3.001327 0.786792 -0.443958
C  1.236109 2.359164 -0.80186
C  -1.269187 1.283371 2.513574
C  1.57551 1.08948 2.761302
C  4.012349 1.554533 -0.508115
C  4.088881 0.082716 -0.888669
C  -5.181298 0.658095 0.507965
C  2.014174 -1.18594 -0.504894
C  0.716871 -1.575247 -0.906799
C  -0.070076 -2.291935 -0.031138
C  -1.439165 -2.78739 -0.376327
C  -5.221701 -0.742203 1.091079
C  -1.371945 -4.142405 -1.077248
C  1.625857 -2.238736 1.467565
H  -2.687843 2.857827 -0.919877
H  -2.999017 2.576774 0.778625
H  -0.564038 2.810588 -1.843014
H  -2.700059 0.069681 0.329531
H  -2.528633 0.457895 -1.373269
H  1.846261 2.641213 -1.648909
H  -1.207839 0.209009 2.705344
H  -0.946268 1.783068 3.428838
H  -2.320426 1.523983 2.374042
H  1.536659 1.871989 3.52398
H  1.035207 0.233538 3.165349
H  2.615916 0.795378 2.657371
H  3.768277 2.166947 -1.379067
H  5.002185 1.87025 -0.174621
H  4.476566 -0.501724 -0.057438
H  4.802852 -0.010252 -1.709642
H  2.451557 -0.150621 -2.180512
H  -6.19039 0.961295 0.219159
H  -4.849444 1.370953 1.27317
H  -1.969833 -2.071646 -1.004127
H  -2.003737 -2.886083 0.551398
H  -5.914044 -0.768412 1.934195
H  -5.567222 -1.468111 0.353443
H  -4.248783 -1.068957 1.462311
H  -0.839177 -4.078817 -2.026153
H  -0.866703 -4.882495 -0.456235
H  -2.375309 -4.512372 -1.284926
H  2.007077 -2.518643 2.443815
elementType: Cl O N C H
totalener: -1554.03473279 hartree
nucrepener: 2742.49686385 hartree
electener: -4296.53159664 hartree
oneelecener: -7577.41586548 hartree
twoeener: 3280.88426884 hartree
cpcmener: -0.02941631 hartree
kineticenergy: 1548.40042176 hartree
xcener: -128.885097740882 hartree
chargesum: -0.0000000
charge: -0.099564 -0.351609 -0.402714 -0.181484 -0.390777 -0.400061 0.139629 -0.220042 0.043964 -0.109529 0.249774 -0.251627 0.030181 -0.198577 -0.306926 -0.305335 0.006649 -0.016747 0.057627 0.291442 -0.119340 0.246377 -0.128578 -0.258748 -0.257484 0.138404 0.080498 0.097727 0.130011 0.060062 0.096530 0.139707 0.104501 0.117378 0.093516 0.119710 0.101514 0.097417 0.098522 0.108102 0.099947 0.106841 0.164648 0.093954 0.067786 0.072174 0.084762 0.090721 0.081890 0.078074 0.084326 0.094280 0.095922 0.134574
qa: -0.0996 -0.3516 -0.4027 -0.1815 -0.3908 -0.4001 0.1396 -0.2200 0.0440 -0.1095 0.2498 -0.2516 0.0302 -0.1986 -0.3069 -0.3053 0.0066 -0.0167 0.0576 0.2914 -0.1193 0.2464 -0.1286 -0.2587 -0.2575 0.1384 0.0805 0.0977 0.1300 0.0601 0.0965 0.1397 0.1045 0.1174 0.0935 0.1197 0.1015 0.0974 0.0985 0.1081 0.0999 0.1068 0.1646 0.0940 0.0678 0.0722 0.0848 0.0907 0.0819 0.0781 0.0843 0.0943 0.0959 0.1346
va: 1.2362 2.0462 1.9302 3.2373 2.9577 2.9715 3.4190 3.7566 3.5783 3.7350 3.6683 3.9741 3.9308 3.8442 3.9203 3.9128 3.8944 3.8211 3.8970 4.0631 3.8619 3.7130 3.8999 3.9059 3.9338 4.1103 1.0216 1.0032 1.0066 0.9904 1.0134 1.0056 0.9982 0.9967 1.0067 0.9965 0.9897 1.0252 0.9953 1.0041 1.0332 1.0086 1.0328 0.9920 0.9917 1.0122 1.0230 1.0116 1.0086 0.9967 1.0062 1.0061 1.0048 0.9963
dispcorr: -0.035112246 hartree
energy: -1554.069845035999
dipole: -20.17636 20.93174 0.75538 1.47644 -1.03186 0.44457 14.36563 -15.05220 -0.68657
magnitude: 1.11338 au
magnitude: 2.83000 debye
