program: Orca
programVersion: 5.0.2
elementType: Cl O O N N N C C C C C C C C C C C C C C C C C C C C H H H H H H H H H H H H H H H H H H H H H H H H H H H H
charge: 0
multiplicity: 1
keywords: wb97x-d3
keywords: def2-TZVPP
keywords: def2/J RIJCOSX
keywords: DEFGRID2
keywords: scfconv7
keywords: smallprint printgap noloewdin
keywords: NOSOSCF
formula: C20H28ClN3O2
InChI: InChI=1/C20H28ClN3O2/c1-5-17-19(21)20(24-13-23-17)22-10-12-26-18-8-7-16(9-11-25-6-2)14(3)15(18)4/h7-8,13,22H,5-6,9-12H2,1-4H3
54 atoms
Cl 0.800555 -0.137877 -2.596682
O  3.226763 1.676962 1.321261
O  -4.337519 0.05587 0.612714
N  3.133212 -0.39464 -0.714328
N  2.139287 -1.964603 0.641724
N  -0.078255 -2.702266 0.27862
C  -0.88041 1.458495 0.689807
C  -0.071813 2.258694 -0.128328
C  1.311339 2.32259 0.076585
C  -2.351632 1.321739 0.391845
C  1.874912 1.609129 1.13796
C  -0.291022 0.792429 1.755332
C  -3.053222 0.209695 1.148992
C  1.068453 0.873065 1.9909
C  -0.699516 3.009827 -1.269718
C  2.186937 3.12079 -0.849662
C  3.924987 0.462508 1.500067
C  4.257536 -0.2190 0.17409
C  -5.089565 -0.940772 1.252212
C  2.066296 -1.161203 -0.417431
C  0.892247 -1.143232 -1.191372
C  -0.1758 -1.928279 -0.805054
C  -1.468114 -1.93923 -1.570754
C  -6.423422 -1.077269 0.553462
C  -2.475953 -2.966995 -1.086126
C  1.069416 -2.681934 0.924752
H  -2.48728 1.132186 -0.677284
H  -2.869991 2.266399 0.588981
H  -0.887413 0.185602 2.42335
H  -3.105232 0.448144 2.222653
H  -2.479551 -0.726024 1.061991
H  1.491365 0.347575 2.836587
H  -0.090236 3.846154 -1.603835
H  -0.85336 2.357365 -2.133331
H  -1.673826 3.415355 -0.99951
H  1.976024 4.189709 -0.779881
H  3.241399 2.993721 -0.620772
H  2.028722 2.834102 -1.891369
H  4.859518 0.710502 2.007463
H  3.381458 -0.232682 2.141687
H  4.717625 -1.185012 0.392861
H  4.993552 0.371517 -0.371965
H  3.006116 0.297293 -1.431958
H  -5.242246 -0.692403 2.31327
H  -4.556391 -1.902781 1.231674
H  -1.247927 -2.102173 -2.629471
H  -1.90484 -0.93656 -1.524498
H  -6.291306 -1.363137 -0.489914
H  -7.025575 -1.84476 1.039204
H  -6.981351 -0.141719 0.582685
H  -2.738939 -2.812121 -0.041789
H  -3.387599 -2.896787 -1.678554
H  -2.088716 -3.980756 -1.173372
H  1.14557 -3.326976 1.793856
totalener: -1554.00805927 hartree
nucrepener: 2763.93613386 hartree
electener: -4317.94419313 hartree
oneelecener: -7619.45346327 hartree
twoeener: 3301.50927014 hartree
kineticenergy: 1548.46517401 hartree
xcener: -128.898009135200 hartree
chargesum: -0.0000000
charge: -0.105422 -0.336579 -0.311989 -0.186404 -0.359711 -0.338572 0.093202 -0.149681 0.008578 -0.129482 0.276362 -0.162231 -0.008379 -0.164882 -0.298224 -0.297971 0.016530 -0.063930 0.027071 0.273247 -0.059627 0.201492 -0.137091 -0.238277 -0.236326 0.109038 0.091034 0.090591 0.099589 0.083881 0.055356 0.106135 0.093298 0.092682 0.105836 0.105675 0.100036 0.090304 0.096203 0.096852 0.093041 0.097832 0.151844 0.070006 0.061068 0.102139 0.094246 0.080410 0.073228 0.083342 0.070795 0.090288 0.093716 0.109834
qa: -0.1054 -0.3366 -0.3120 -0.1864 -0.3597 -0.3386 0.0932 -0.1497 0.0086 -0.1295 0.2764 -0.1622 -0.0084 -0.1649 -0.2982 -0.2980 0.0165 -0.0639 0.0271 0.2732 -0.0596 0.2015 -0.1371 -0.2383 -0.2363 0.1090 0.0910 0.0906 0.0996 0.0839 0.0554 0.1061 0.0933 0.0927 0.1058 0.1057 0.1000 0.0903 0.0962 0.0969 0.0930 0.0978 0.1518 0.0700 0.0611 0.1021 0.0942 0.0804 0.0732 0.0833 0.0708 0.0903 0.0937 0.1098
va: 1.2444 2.0479 1.9821 3.2049 2.9759 2.9572 3.5046 3.7324 3.6534 3.7856 3.6870 3.8922 3.9659 3.9563 3.9235 3.9101 3.8358 3.8846 3.9151 4.0916 3.9380 3.7564 3.8910 3.9641 3.9369 4.1756 1.0013 1.0085 1.0177 0.9957 0.9871 1.0111 1.0040 1.0033 1.0000 1.0024 1.0252 0.9927 1.0065 1.0117 1.0232 0.9990 1.0447 0.9933 0.9819 1.0078 0.9995 1.0067 1.0091 1.0071 1.0136 1.0041 1.0146 0.9965
dispcorr: -0.036349674 hartree
energy: -1554.044408943162
dipole: -24.98645 25.41724 0.43079 1.76618 -1.70077 0.06541 6.22429 -6.37211 -0.14783
magnitude: 0.46012 au
magnitude: 1.16953 debye
