program: Orca
programVersion: 5.0.2
elementType: Cl O O N N N C C C C C C C C C C C C C C C C C C C C H H H H H H H H H H H H H H H H H H H H H H H H H H H H
charge: 0
multiplicity: 1
keywords: wb97x-d3
keywords: def2-TZVPP
keywords: def2/J RIJCOSX
keywords: DEFGRID2
keywords: scfconv7
keywords: smallprint printgap noloewdin
keywords: NOSOSCF
formula: C20H28ClN3O2
InChI: InChI=1/C20H28ClN3O2/c1-5-17-19(21)20(24-13-23-17)22-10-12-26-18-8-7-16(9-11-25-6-2)14(3)15(18)4/h7-8,13,22H,5-6,9-12H2,1-4H3
54 atoms
Cl 0.148522 -1.64848 1.351579
O  3.110737 1.99154 0.161651
O  -3.3157 0.366867 0.816818
N  2.828588 -0.870636 0.244058
N  2.25774 -1.196985 -1.957733
N  0.089572 -1.883545 -2.602319
C  -1.042212 2.177215 -0.057248
C  -0.396652 2.01607 1.173524
C  1.002415 1.908873 1.229348
C  -2.52846 2.395294 -0.200653
C  1.750935 1.981719 0.053815
C  -0.266407 2.198132 -1.2119
C  -3.384015 1.146034 -0.344403
C  1.110793 2.107685 -1.171777
C  -1.154802 1.93774 2.467633
C  1.684243 1.721908 2.554989
C  3.87773 1.17436 -0.695534
C  4.067223 -0.2207 -0.110247
C  -4.321915 -0.607253 0.90582
C  1.905929 -1.214628 -0.675228
C  0.599018 -1.593963 -0.31909
C  -0.294732 -1.908667 -1.320925
C  -1.707106 -2.311588 -1.041045
C  -4.064135 -1.468532 2.1217
C  -1.821123 -3.797387 -0.705444
C  1.336451 -1.538387 -2.839606
H  -2.70118 2.992117 -1.10034
H  -2.918184 2.996464 0.623493
H  -0.750995 2.32454 -2.173178
H  -3.057842 0.56663 -1.221416
H  -4.420955 1.460441 -0.539571
H  1.675689 2.173388 -2.092215
H  -2.206161 2.18193 2.362096
H  -1.112885 0.924624 2.873662
H  -0.731942 2.60498 3.220025
H  2.75632 1.579606 2.448712
H  1.543687 2.587236 3.206195
H  1.275927 0.860971 3.088959
H  3.442904 1.097234 -1.69366
H  4.853906 1.652629 -0.800212
H  4.667688 -0.165657 0.798271
H  4.618129 -0.832105 -0.827225
H  2.503273 -0.752234 1.188002
H  -4.346091 -1.234661 0.002172
H  -5.311786 -0.131897 0.978531
H  -2.294175 -2.091205 -1.933001
H  -2.103308 -1.709435 -0.224144
H  -3.105391 -1.982102 2.043575
H  -4.054074 -0.870055 3.032424
H  -4.844305 -2.22287 2.222152
H  -1.44925 -4.411039 -1.52542
H  -1.255142 -4.050484 0.190567
H  -2.861667 -4.070062 -0.528378
H  1.645967 -1.525365 -3.879515
totalener: -1554.00922640 hartree
nucrepener: 2794.42137841 hartree
electener: -4348.43060481 hartree
oneelecener: -7680.75609784 hartree
twoeener: 3332.32549302 hartree
kineticenergy: 1548.46632021 hartree
xcener: -128.891527844298 hartree
chargesum: 0.0000000
charge: -0.108688 -0.334334 -0.318378 -0.194815 -0.368195 -0.324208 0.235669 -0.167480 -0.021976 -0.188382 0.222832 -0.205704 0.013287 -0.123913 -0.266706 -0.292895 0.018946 -0.062654 0.000622 0.271128 -0.051126 0.231329 -0.152237 -0.242665 -0.256481 0.123631 0.088294 0.088632 0.097927 0.070178 0.079649 0.108480 0.079196 0.088935 0.097435 0.095106 0.105253 0.090377 0.096013 0.094579 0.099762 0.093364 0.156412 0.072286 0.084748 0.099294 0.049399 0.073888 0.087556 0.083236 0.102417 0.085692 0.083973 0.111313
qa: -0.1087 -0.3343 -0.3184 -0.1948 -0.3682 -0.3242 0.2357 -0.1675 -0.0220 -0.1884 0.2228 -0.2057 0.0133 -0.1239 -0.2667 -0.2929 0.0189 -0.0627 0.0006 0.2711 -0.0511 0.2313 -0.1522 -0.2427 -0.2565 0.1236 0.0883 0.0886 0.0979 0.0702 0.0796 0.1085 0.0792 0.0889 0.0974 0.0951 0.1053 0.0904 0.0960 0.0946 0.0998 0.0934 0.1564 0.0723 0.0847 0.0993 0.0494 0.0739 0.0876 0.0832 0.1024 0.0857 0.0840 0.1113
va: 1.2316 2.0516 1.9508 3.2123 2.9692 3.0507 3.3473 3.7765 3.6332 3.9064 3.7574 3.9767 3.9077 3.8891 3.9020 3.9008 3.8287 3.8800 3.8982 4.0564 3.8436 3.7678 3.8831 3.9549 3.9262 4.1551 1.0075 1.0071 1.0113 0.9916 1.0001 1.0086 1.0328 1.0006 0.9993 1.0236 1.0066 0.9947 1.0134 1.0074 0.9992 1.0268 1.0436 0.9816 0.9985 1.0248 1.0153 1.0074 1.0051 1.0113 1.0067 1.0086 1.0055 0.9968
dispcorr: -0.036639249 hartree
energy: -1554.045865651450
dipole: -20.10503 19.87126 -0.23378 2.36644 -2.38941 -0.02298 6.60797 -6.21280 0.39517
magnitude: 0.45972 au
magnitude: 1.16850 debye
