program: Orca
programVersion: 5.0.2
elementType: Cl O O N N N C C C C C C C C C C C C C C C C C C C C H H H H H H H H H H H H H H H H H H H H H H H H H H H H
charge: 0
multiplicity: 1
keywords: wb97x-d3
keywords: def2-TZVPP
keywords: def2/J RIJCOSX
keywords: DEFGRID2
keywords: scfconv7
keywords: smallprint printgap noloewdin
keywords: NOSOSCF
formula: C20H28ClN3O2
InChI: InChI=1/C20H28ClN3O2/c1-5-17-19(21)20(24-13-23-17)22-10-12-26-18-8-7-16(9-11-25-6-2)14(3)15(18)4/h7-8,13,22H,5-6,9-12H2,1-4H3
54 atoms
Cl -0.588623 -1.433846 0.50934
O  2.985733 1.950937 0.325219
O  -3.125683 0.37539 1.469255
N  2.355484 -0.972444 0.335894
N  2.58002 -1.747505 -1.817896
N  0.755525 -2.658703 -3.013537
C  -1.168188 2.105937 0.099407
C  -0.506337 2.319612 1.312406
C  0.894725 2.238074 1.377844
C  -2.666339 2.162152 -0.0552
C  1.626435 1.9551 0.222242
C  -0.406543 1.820365 -1.028635
C  -3.365555 0.83052 0.169544
C  0.970652 1.745622 -0.984389
C  -1.24649 2.628887 2.583579
C  1.595991 2.46792 2.687736
C  3.738806 0.970435 -0.355011
C  3.674338 -0.388176 0.330145
C  -3.796331 -0.816616 1.776931
C  1.801097 -1.510969 -0.766049
C  0.428875 -1.831523 -0.829166
C  -0.060795 -2.4086 -1.981161
C  -1.507433 -2.730746 -2.195985
C  -3.403254 -1.255377 3.169346
C  -2.186087 -1.619408 -2.994653
C  2.015301 -2.31176 -2.870772
H  -2.905022 2.477964 -1.074412
H  -3.110524 2.917986 0.594871
H  -0.904565 1.661904 -1.978644
H  -3.007193 0.098109 -0.568659
H  -4.445095 0.956397 -0.009444
H  1.520003 1.540449 -1.893533
H  -0.842648 3.518366 3.069601
H  -2.308113 2.789864 2.431479
H  -1.159308 1.806551 3.296501
H  1.464072 3.495329 3.034411
H  1.197678 1.821938 3.472695
H  2.664625 2.289033 2.618257
H  3.449843 0.871795 -1.404866
H  4.770625 1.326246 -0.34111
H  3.998413 -0.294292 1.367621
H  4.36693 -1.06684 -0.168061
H  1.724438 -0.67966 1.062971
H  -3.544957 -1.60399 1.050825
H  -4.886193 -0.675107 1.7180
H  -2.024449 -2.883121 -1.248931
H  -1.561577 -3.665878 -2.754614
H  -3.912603 -2.182913 3.430395
H  -2.329721 -1.431775 3.237203
H  -3.67209 -0.503437 3.911008
H  -2.147201 -0.670682 -2.458364
H  -1.694753 -1.482564 -3.957196
H  -3.233262 -1.85819 -3.17933
H  2.670121 -2.504833 -3.714054
totalener: -1554.01014951 hartree
nucrepener: 2767.68334609 hartree
electener: -4321.69349560 hartree
oneelecener: -7627.03742115 hartree
twoeener: 3305.34392555 hartree
kineticenergy: 1548.47438939 hartree
xcener: -128.893816316518 hartree
chargesum: 0.0000000
charge: -0.101628 -0.326207 -0.310932 -0.180606 -0.370844 -0.340733 0.223945 -0.104936 -0.019570 -0.187075 0.152059 -0.233960 0.021177 -0.124414 -0.276748 -0.259619 0.000873 -0.037019 0.001698 0.271612 -0.045146 0.186282 -0.113759 -0.232153 -0.247348 0.119681 0.090693 0.089288 0.107103 0.038865 0.083194 0.116161 0.098948 0.082716 0.093649 0.099380 0.090869 0.094571 0.096840 0.096647 0.101354 0.093519 0.154092 0.064004 0.076238 0.069655 0.090228 0.081536 0.074118 0.085271 0.051014 0.110230 0.092327 0.112863
qa: -0.1016 -0.3262 -0.3109 -0.1806 -0.3708 -0.3407 0.2239 -0.1049 -0.0196 -0.1871 0.1521 -0.2340 0.0212 -0.1244 -0.2767 -0.2596 0.0009 -0.0370 0.0017 0.2716 -0.0451 0.1863 -0.1138 -0.2322 -0.2473 0.1197 0.0907 0.0893 0.1071 0.0389 0.0832 0.1162 0.0989 0.0827 0.0936 0.0994 0.0909 0.0946 0.0968 0.0966 0.1014 0.0935 0.1541 0.0640 0.0762 0.0697 0.0902 0.0815 0.0741 0.0853 0.0510 0.1102 0.0923 0.1129
va: 1.2592 2.0547 1.9630 3.2172 2.9726 3.0420 3.3332 3.8023 3.6985 3.8930 3.7943 3.9820 3.9319 3.8563 3.9100 3.8992 3.8669 3.8597 3.9147 4.0434 3.8387 3.8390 3.8883 3.9488 3.9022 4.1599 1.0071 1.0076 1.0034 0.9952 1.0056 1.0093 0.9982 1.0278 0.9987 1.0017 0.9949 1.0271 1.0058 1.0081 1.0018 1.0336 1.0457 0.9853 0.9974 1.0161 1.0256 1.0118 1.0094 1.0052 1.0089 1.0124 1.0089 0.9958
dispcorr: -0.034973619 hartree
energy: -1554.045123132622
dipole: -17.40160 16.99769 -0.40391 8.03969 -8.04574 -0.00605 8.97091 -8.47503 0.49588
magnitude: 0.63959 au
magnitude: 1.62572 debye
