program: Gaussian 09
title: 000054847
version: EM64L-G09RevD.01
frameworkgroup: C1[X(C12H3Cl5O2)]
method: RPBEPBE
basis: SDD
operation: Freq
keyword: #p
keyword: freq=noraman
keyword: PBEPBE/SDD
title: #p freq=noraman PBEPBE/SDD
converged: NO NO NO NO
title: Mulliken charges:
elementType: Cl Cl Cl Cl Cl O O C C C C C C C C C C C C H H H
charge: 0.059559 0.014119 0.013684 0.015653 -0.024126 -0.241398 -0.256040 0.478694 0.424017 0.394019 0.325026 -0.342052 -0.354382 -0.309235 -0.369546 -0.106812 -0.259659 -0.238720 -0.093165 0.295193 0.288297 0.286875
chargesum: 0.00000
title: Mulliken charges with hydrogens summed into heavy atoms:
elementType: Cl Cl Cl Cl Cl O O C C C C C C C C C C C C
charge: 0.059559 0.014119 0.013684 0.015653 -0.024126 -0.241398 -0.256040 0.478694 0.424017 0.394019 0.325026 -0.342052 -0.354382 -0.309235 -0.074353 -0.106812 0.028638 0.048155 -0.093165
polarizability: 2.96066099e+02 -1.27252980e+01 2.26052668e+02 1.73515354e-04 3.73239662e-03 6.37344842e+01
1716.lowfreq: -0.0016 0.0014 0.0027 2.9043 4.4718 4.8049 25.8174 41.0888 73.4382
frequency: 25.8113 41.0859 73.4374 90.1660 131.1552 142.9365 147.4011 158.1163 176.3726 185.1491 193.2247 227.0081 278.1068 281.6035 317.7593 329.8924 339.4729 368.7933 381.2632 412.6193 466.6619 512.2763 516.5203 524.6688 548.2210 566.3924 575.9723 584.6031 657.3840 667.0835 683.4688 698.7563 779.8111 809.5869 839.3092 845.7405 858.9416 881.0094 914.7623 926.0133 1068.1785 1112.3204 1130.7084 1173.8615 1199.4074 1215.8491 1260.9791 1357.9368 1364.7879 1395.2063 1398.3018 1421.3401 1448.0764 1561.9497 1566.4276 1592.2836 1616.5955 3187.6372 3188.0883 3189.6830
redmass: 20.7886 19.0211 25.1273 26.0265 11.5425 33.3984 10.8433 10.6143 24.8205 21.9911 24.3924 5.8595 20.5088 6.9848 28.4518 9.2080 11.3533 12.9305 17.2720 9.2497 9.1078 5.0575 9.5251 5.0506 5.1896 11.7742 7.7973 11.6875 10.6835 5.3496 8.8446 7.1142 11.3767 8.5585 1.4000 1.3918 1.3856 11.2647 10.2817 10.6434 2.1808 5.8750 3.9259 1.9530 1.6005 3.3601 4.8417 11.3937 7.6118 4.8669 9.0980 4.6867 4.1094 9.2815 9.9102 9.7320 10.0924 1.0933 1.0932 1.0939
irintensity: 0.1165 0.0837 0.0024 0.0818 0.0832 0.0108 0.7798 0.1146 0.1917 0.2387 0.1819 0.1241 0.0189 0.1783 0.1062 0.0027 0.3568 5.9046 1.1898 5.2380 0.4805 3.8513 14.2248 8.0843 2.6309 7.0672 0.8163 3.6700 0.6935 9.5168 1.0684 0.0171 127.7411 1.6131 21.7109 31.5895 19.4517 31.9736 61.1208 245.9509 0.9170 35.1528 72.3091 19.5366 1.2375 0.8219 109.7721 72.0548 7.3305 45.8015 374.1907 234.0685 413.6276 74.1046 5.5048 26.0043 64.8736 3.5609 3.2368 3.2931
temp: 298.150 k
press: 1.00000 atm
elementType: 17 17 17 17 17 8 8 6 6 6 6 6 6 6 6 6 6 6 6 1 1 1
symmnumber: 1
zpe: 302704.1 jmol-1
zpe.correction: 0.115294 hartree
zpe.thermalcorrener: 0.132104 hartree
zpe.thermalcorrenthalpy: 0.133048 hartree
zpe.thermalcorrgfe: 0.068751 hartree
zpe.sumelectzpe: -2908.471115 hartree
zpe.sumelectthermal: -2908.454305 hartree
zpe.sumelectthermalent: -2908.453361 hartree
zpe.sumelectthermalfe: -2908.517658 hartree
dipole: -0.3086 1.1148 0.0000
dipole: 1.1568
quadrupole: -140.4131 -145.0365 -143.4338
quadrupole: 5.6339 0.0004 0.0003
quadrupole: 2.5480 -2.0754 -0.4727 5.6339 0.0004 0.0003
hfenergy: -2908.5864088 hartree
pointgroup: C01 [X(C12H3Cl5O2)]
dipole: 0.1003396 0.4439017 0.0000114 debye
dipolederiv: 0.0008539 -0.0264748 0.0000041 -0.1171124 -0.5875959 0.0000789 0.000016 0.0000879 0.0199272 -0.0637285 -0.0307213 0.0000008 0.0275526 -0.695627 0.000042 -0.0000059 0.0000784 -0.0119468 -0.0677241 -0.0249032 -0.0000064 0.0359861 -0.648117 -0.0000518 -0.000002 -0.0000505 -0.0129655 -0.7099811 -0.2294466 -0.0000241 -0.2596128 -0.1459633 -0.0000081 -0.0000532 -0.0000185 -0.0158208 -0.7690844 -0.2678109 -0.0000393 -0.3125648 -0.2418562 -0.0000155 -0.0000662 -0.0000135 -0.0455516 -2.0619757 0.1399477 0.0000644 0.1724441 -0.2581977 -0.000009 0.0000688 -0.0000276 -0.1138578 -2.0802945 0.1069334 0.000055 0.1359764 -0.3468724 0.0000017 0.0001423 0.0000139 -0.1295802 1.1966664 -0.183224 -0.0000739 -1.0127163 0.0707472 0.0000906 -0.0000728 0.000048 0.1385167 1.239155 0.0163809 -0.0000566 0.8922554 -0.2227109 -0.0000191 -0.0001495 0.0000279 0.0924329 1.1980778 0.0346728 -0.0000373 0.8890464 -0.3090727 -0.0000493 -0.0000376 -0.0000228 0.0838733 1.2750073 -0.1524374 -0.000018 -0.9135707 0.3674392 0.000027 -0.0000445 0.000005 0.0966631 -0.4157065 0.0574542 -0.0000142 0.0766466 0.886981 -0.0001612 -0.0000264 -0.0001769 -0.0987566 0.0209824 0.058222 0.0000013 -0.0840291 1.1160239 -0.0000858 0.000055 -0.0001251 -0.0975316 0.1050204 0.0602386 0.0000375 -0.1146586 1.0722259 0.0001093 0.0000352 0.0001147 -0.0747332 -0.6252833 -0.0310128 -0.0000046 -0.0891674 -0.0967738 -0.0000083 0.0000001 0.0000054 -0.1252657 1.0558689 0.248698 0.0000678 0.4143938 0.1044827 0.0000597 0.0001175 0.0000664 -0.0429821 -0.3367673 -0.0561706 -0.0000093 -0.1059953 -0.3313151 0.000008 -0.0000331 0.0000274 -0.056273 -0.3829537 -0.1410553 -0.000017 -0.1482723 -0.377103 -0.0000448 -0.00002 -0.0000394 -0.0760859 1.184738 0.3499641 0.0000828 0.4539734 0.438814 0.0000304 0.0001223 0.0000279 -0.0651081 0.1175303 0.0143446 -0.0000035 0.0097329 0.0486748 -0.0000011 -0.0000107 -0.0000173 0.1865247 0.0627308 0.0237154 -0.0000018 0.0212466 0.0729336 0.000004 -0.0000256 -0.0000041 0.1728836 0.0568681 0.0326854 -0.0000077 0.0284456 0.0828826 0.0000026 -0.0000096 -0.0000075 0.1756373 unknown
polarizability: 294.6919839|16.0078591|227.426783|0.0003516|-0.0037198|63.7344842 unknown
InChI: InChI=1S/C12H3Cl5O2/c13-4-1-6(15)10-8(2-4)18-11-7(16)3-5(14)9(17)12(11)19-10/h1-3H
charge 0 multiplicity 1
22 atoms
Cl -2.478947 -2.870531 0.0004
Cl -2.025434 3.535307 -0.000087
Cl 2.310713 -3.22611 -0.000203
Cl -5.18603 -1.011207 0.000016
Cl 5.431227 1.368759 0.000145
O  0.020557 -1.299597 -0.000035
O  0.252582 1.601624 -0.000091
C  -1.116351 -0.461584 0.000067
C  -1.002169 0.951121 0.000045
C  1.277862 -0.646493 -0.00005
C  1.39706 0.764485 -0.000098
C  -2.384906 -1.077018 0.000166
C  -2.167868 1.737426 0.000081
C  2.44792 -1.427291 -0.000042
C  2.649721 1.394309 -0.000122
C  -3.542996 -0.264566 0.00013
C  -3.442764 1.138832 0.000092
C  3.724842 -0.825779 0.000042
C  3.799488 0.579246 0.000004
H  2.706633 2.485013 -0.00012
H  -4.342899 1.757408 0.00005
H  4.625557 -1.443452 0.000111
