program: Orca
programVersion: 5.0.2
elementType: Cl O O N N N C C C C C C C C C C C C C C C C C C C C H H H H H H H H H H H H H H H H H H H H H H H H H H H H
charge: 0
multiplicity: 1
keywords: wb97x-d3
keywords: def2-TZVPP
keywords: def2/J RIJCOSX
keywords: DEFGRID2
keywords: scfconv7
keywords: smallprint printgap noloewdin
keywords: NOSOSCF
formula: C20H28ClN3O2
InChI: InChI=1/C20H28ClN3O2/c1-5-17-19(21)20(24-13-23-17)22-10-12-26-18-8-7-16(9-11-25-6-2)14(3)15(18)4/h7-8,13,22H,5-6,9-12H2,1-4H3
54 atoms
Cl 3.132414 -2.521485 1.493975
O  2.540207 1.990535 0.462177
O  -5.108952 2.068171 -0.737027
N  3.345988 -0.474514 -0.696632
N  1.259692 -0.900869 -1.582345
N  -0.24024 -2.42904 -0.582455
C  -1.448249 1.436676 -0.54561
C  -0.929881 0.921424 0.649471
C  0.420078 1.106729 0.972549
C  -2.884632 1.247395 -0.957859
C  1.234801 1.839232 0.105686
C  -0.61186 2.174294 -1.372239
C  -3.788483 2.29919 -0.333618
C  0.715746 2.387659 -1.056441
C  -1.791533 0.125008 1.590666
C  0.990608 0.528091 2.235943
C  3.528886 1.98791 -0.536225
C  3.504605 0.749971 -1.437196
C  -6.0204 2.998641 -0.21892
C  2.181435 -1.15943 -0.661372
C  1.920922 -2.140446 0.313709
C  0.679263 -2.7433 0.335097
C  0.298018 -3.778949 1.348704
C  -7.410959 2.651924 -0.701562
C  0.771852 -5.170967 0.934183
C  0.110468 -1.537384 -1.488714
H  -3.246857 0.250797 -0.697867
H  -2.962125 1.321972 -2.04502
H  -1.006506 2.586108 -2.293693
H  -3.447231 3.299773 -0.640981
H  -3.699984 2.269397 0.763778
H  1.335793 2.970338 -1.725606
H  -1.637768 0.4258 2.626928
H  -2.852716 0.232336 1.383205
H  -1.561088 -0.941239 1.52343
H  0.584457 -0.460681 2.443785
H  2.07176 0.433672 2.190273
H  0.759355 1.157854 3.098875
H  3.491127 2.884822 -1.167579
H  4.47312 2.035935 0.010697
H  4.439213 0.73045 -2.005564
H  2.693753 0.79855 -2.160504
H  3.997028 -0.654559 0.049402
H  -5.756594 4.01948 -0.534282
H  -5.99411 2.997968 0.88143
H  -0.788968 -3.771623 1.43103
H  0.704537 -3.526151 2.329525
H  -7.70535 1.656107 -0.371207
H  -8.134711 3.365282 -0.307552
H  -7.468583 2.679901 -1.789349
H  0.450193 -5.917732 1.659774
H  0.358898 -5.445957 -0.0358
H  1.858253 -5.219586 0.866055
H  -0.630468 -1.29445 -2.242265
totalener: -1554.00809251 hartree
nucrepener: 2664.35839706 hartree
electener: -4218.36648957 hartree
oneelecener: -7420.47767727 hartree
twoeener: 3202.11118770 hartree
kineticenergy: 1548.47253517 hartree
xcener: -128.893807220233 hartree
chargesum: -0.0000000
charge: -0.096466 -0.319901 -0.312726 -0.174364 -0.328235 -0.323190 0.044743 -0.115787 0.053598 -0.099380 0.219373 -0.113352 0.002779 -0.166719 -0.304722 -0.288626 -0.021698 -0.070599 0.056002 0.243717 -0.079219 0.145773 -0.110299 -0.237075 -0.251832 0.142885 0.088092 0.073847 0.102586 0.071815 0.068237 0.109698 0.105752 0.084689 0.102840 0.087396 0.081866 0.113728 0.082622 0.098799 0.105198 0.120274 0.131439 0.053965 0.053495 0.088677 0.075100 0.081497 0.070434 0.081470 0.085624 0.097440 0.081649 0.107091
qa: -0.0965 -0.3199 -0.3127 -0.1744 -0.3282 -0.3232 0.0447 -0.1158 0.0536 -0.0994 0.2194 -0.1134 0.0028 -0.1667 -0.3047 -0.2886 -0.0217 -0.0706 0.0560 0.2437 -0.0792 0.1458 -0.1103 -0.2371 -0.2518 0.1429 0.0881 0.0738 0.1026 0.0718 0.0682 0.1097 0.1058 0.0847 0.1028 0.0874 0.0819 0.1137 0.0826 0.0988 0.1052 0.1203 0.1314 0.0540 0.0535 0.0887 0.0751 0.0815 0.0704 0.0815 0.0856 0.0974 0.0816 0.1071
va: 1.2491 2.0720 1.9967 3.1989 2.9798 2.9865 3.5347 3.6611 3.6078 3.8014 3.8047 4.0139 3.9681 3.9155 3.9411 3.9330 3.9376 3.8136 3.9117 4.1101 3.8521 3.8395 3.8564 3.9648 3.9283 4.1406 1.0130 1.0194 1.0087 0.9983 0.9909 1.0060 0.9924 1.0088 1.0002 0.9918 1.0308 0.9989 0.9988 0.9947 1.0099 1.0346 1.0592 0.9885 0.9888 1.0245 1.0156 1.0072 1.0091 1.0073 1.0061 1.0059 1.0085 0.9989
dispcorr: -0.033439790 hartree
energy: -1554.041532300215
dipole: -31.97624 32.79222 0.81598 11.60295 -11.11688 0.48607 0.89251 -0.67904 0.21347
magnitude: 0.97348 au
magnitude: 2.47439 debye
