program: Orca
programVersion: 5.0.2
elementType: Cl O O N N N C C C C C C C C C C C C C C C C C C C C H H H H H H H H H H H H H H H H H H H H H H H H H H H H
charge: 0
multiplicity: 1
keywords: wb97x-d3
keywords: def2-TZVPP
keywords: def2/J RIJCOSX
keywords: DEFGRID2
keywords: scfconv7
keywords: smallprint printgap noloewdin
keywords: NOSOSCF
formula: C20H28ClN3O2
InChI: InChI=1/C20H28ClN3O2/c1-5-17-19(21)20(24-13-23-17)22-10-12-26-18-8-7-16(9-11-25-6-2)14(3)15(18)4/h7-8,13,22H,5-6,9-12H2,1-4H3
54 atoms
Cl -0.456396 -0.277733 -1.854737
O  3.249174 1.765117 0.703385
O  -4.374745 0.433414 1.016662
N  2.500703 -0.065118 -1.498099
N  2.770897 -2.141768 -0.557905
N  0.947152 -3.598819 -0.196653
C  -0.803528 1.331995 1.546899
C  -0.32796 2.439829 0.837063
C  1.03693 2.562255 0.539827
C  -2.261837 1.126409 1.860199
C  1.926928 1.574572 0.969549
C  0.110614 0.369132 1.956655
C  -3.024442 0.571475 0.666456
C  1.459967 0.478564 1.683376
C  -1.255983 3.519482 0.353608
C  1.530259 3.753757 -0.23282
C  4.047458 0.67154 0.30546
C  3.850665 0.321912 -1.164459
C  -5.128887 -0.355241 0.136029
C  1.961837 -1.22585 -1.080059
C  0.578802 -1.489458 -1.179078
C  0.101102 -2.692778 -0.706646
C  -1.348335 -3.07423 -0.680098
C  -5.346089 0.267333 -1.233861
C  -1.845309 -3.245855 0.753393
C  2.218764 -3.274387 -0.158767
H  -2.735555 2.052985 2.192752
H  -2.359458 0.425885 2.692839
H  -0.24045 -0.491004 2.514723
H  -2.590189 -0.397445 0.380041
H  -2.894141 1.233431 -0.200901
H  2.134967 -0.287647 2.040384
H  -0.908236 4.509302 0.653468
H  -1.321288 3.528278 -0.737242
H  -2.268515 3.407895 0.731931
H  0.977151 3.882705 -1.165465
H  1.400744 4.677469 0.335717
H  2.585227 3.676805 -0.478292
H  5.082495 0.98275 0.458657
H  3.884537 -0.214305 0.923226
H  4.537427 -0.483727 -1.427299
H  4.103856 1.181392 -1.786359
H  1.860039 0.667261 -1.75213
H  -6.093772 -0.509937 0.623319
H  -4.668224 -1.348402 0.017636
H  -1.452688 -4.021468 -1.213976
H  -1.960136 -2.34327 -1.206466
H  -6.028458 -0.350665 -1.818685
H  -5.785668 1.261254 -1.14676
H  -4.419863 0.353891 -1.803192
H  -1.750181 -2.317714 1.317764
H  -2.896212 -3.534389 0.763807
H  -1.274145 -4.014839 1.270183
H  2.897283 -4.01499 0.251513
totalener: -1554.00869718 hartree
nucrepener: 2735.31805599 hartree
electener: -4289.32675318 hartree
oneelecener: -7561.83956229 hartree
twoeener: 3272.51280912 hartree
kineticenergy: 1548.46665876 hartree
xcener: -128.893579594846 hartree
chargesum: -0.0000000
charge: -0.103903 -0.327931 -0.319424 -0.176927 -0.371160 -0.343198 0.229643 -0.148694 0.009476 -0.120441 0.109889 -0.278652 0.064196 -0.054733 -0.326782 -0.262730 0.003995 -0.041583 0.044986 0.262217 -0.049691 0.193757 -0.099092 -0.249616 -0.261023 0.119599 0.088836 0.082561 0.108743 -0.025369 0.079525 0.117770 0.103629 0.101680 0.092669 0.089972 0.101937 0.095771 0.097698 0.099208 0.092882 0.100499 0.150655 0.087053 0.040247 0.093174 0.071177 0.082260 0.088040 0.074231 0.065381 0.091269 0.112732 0.113595
qa: -0.1039 -0.3279 -0.3194 -0.1769 -0.3712 -0.3432 0.2296 -0.1487 0.0095 -0.1204 0.1099 -0.2787 0.0642 -0.0547 -0.3268 -0.2627 0.0040 -0.0416 0.0450 0.2622 -0.0497 0.1938 -0.0991 -0.2496 -0.2610 0.1196 0.0888 0.0826 0.1087 -0.0254 0.0795 0.1178 0.1036 0.1017 0.0927 0.0900 0.1019 0.0958 0.0977 0.0992 0.0929 0.1005 0.1507 0.0871 0.0402 0.0932 0.0712 0.0823 0.0880 0.0742 0.0654 0.0913 0.1127 0.1136
va: 1.2344 2.0540 2.0174 3.2189 2.9644 3.0383 3.3149 3.7690 3.6700 3.8026 3.8846 4.0205 3.9791 3.7833 3.9172 3.9007 3.8514 3.8705 3.9464 4.0610 3.8491 3.8195 3.8875 3.8853 3.8961 4.1587 1.0139 1.0154 1.0076 0.9997 0.9811 1.0073 1.0010 0.9928 1.0112 0.9942 1.0021 1.0266 1.0076 1.0087 1.0306 1.0011 1.0473 0.9942 0.9995 1.0213 1.0159 1.0144 1.0081 1.0023 1.0049 1.0071 1.0207 0.9954
dispcorr: -0.034852086 hartree
energy: -1554.043549269233
dipole: -20.20166 20.36204 0.16038 7.73866 -7.35797 0.38069 5.12762 -5.83133 -0.70370
magnitude: 0.81599 au
magnitude: 2.07409 debye
