program: Orca
programVersion: 5.0.2
elementType: Cl O O N N N C C C C C C C C C C C C C C C C C C C C H H H H H H H H H H H H H H H H H H H H H H H H H H H H
charge: 0
multiplicity: 1
keywords: wb97x-d3
keywords: def2-TZVPP
keywords: def2/J RIJCOSX
keywords: DEFGRID2
keywords: scfconv7
keywords: smallprint printgap noloewdin
keywords: NOSOSCF
formula: C20H28ClN3O2
InChI: InChI=1/C20H28ClN3O2/c1-5-17-19(21)20(24-13-23-17)22-10-12-26-18-8-7-16(9-11-25-6-2)14(3)15(18)4/h7-8,13,22H,5-6,9-12H2,1-4H3
54 atoms
Cl -0.084653 -1.672487 0.994905
O  3.166572 2.053906 0.122801
O  -4.397043 0.673094 0.940791
N  2.692713 -0.877166 0.228301
N  2.514784 -1.515773 -1.970445
N  0.55233 -2.513434 -2.829207
C  -0.988492 2.035369 0.351189
C  -0.203749 2.311458 1.475983
C  1.196222 2.291481 1.390171
C  -2.493193 1.991842 0.39264
C  1.806046 2.009137 0.165142
C  -0.346298 1.754568 -0.848841
C  -2.995638 0.672564 0.958048
C  1.030096 1.744824 -0.956283
C  -0.825544 2.621644 2.809647
C  2.026021 2.58253 2.609649
C  3.874083 1.123438 -0.666818
C  3.968453 -0.242576 0.000302
C  -4.987108 -0.447362 1.544529
C  1.959351 -1.407629 -0.767404
C  0.635656 -1.854529 -0.568261
C  -0.041998 -2.409643 -1.632497
C  -1.459649 -2.88981 -1.56759
C  -4.82559 -1.738914 0.757481
C  -2.40156 -1.905458 -2.257926
C  1.782735 -2.063821 -2.92482
H  -2.885838 2.108164 -0.620253
H  -2.907564 2.820522 0.971166
H  -0.939997 1.543702 -1.730652
H  -2.616828 0.529791 1.982474
H  -2.578069 -0.147827 0.360871
H  1.482165 1.536771 -1.916636
H  -0.635072 1.825121 3.533131
H  -0.415352 3.537429 3.238121
H  -1.903212 2.75015 2.753083
H  3.083042 2.400246 2.440307
H  1.926676 3.625997 2.917873
H  1.713543 1.974876 3.460866
H  3.457612 1.020367 -1.67138
H  4.880636 1.530576 -0.778895
H  4.461138 -0.146044 0.968685
H  4.590295 -0.890445 -0.618617
H  2.214278 -0.66499 1.086846
H  -6.049028 -0.212151 1.6415
H  -4.597525 -0.588604 2.56404
H  -1.776437 -3.056488 -0.53875
H  -1.504937 -3.851797 -2.080613
H  -5.396844 -2.537462 1.232359
H  -5.193875 -1.622907 -0.262225
H  -3.787291 -2.069624 0.707658
H  -3.425696 -2.276948 -2.240926
H  -2.393665 -0.934221 -1.76218
H  -2.110169 -1.758656 -3.296961
H  2.25524 -2.146239 -3.897988
totalener: -1554.00962764 hartree
nucrepener: 2721.72314639 hartree
electener: -4275.73277403 hartree
oneelecener: -7534.65317339 hartree
twoeener: 3258.92039935 hartree
kineticenergy: 1548.46174972 hartree
xcener: -128.891960920171 hartree
chargesum: 0.0000000
charge: -0.103066 -0.325921 -0.317715 -0.178583 -0.372576 -0.339920 0.197554 -0.119870 0.001267 -0.110313 0.123275 -0.260950 0.054208 -0.074163 -0.327453 -0.262361 -0.000162 -0.036754 0.043753 0.278254 -0.077672 0.212716 -0.116475 -0.246670 -0.269980 0.119092 0.082087 0.086832 0.105296 0.078353 -0.015107 0.117687 0.102811 0.102874 0.091727 0.094404 0.101078 0.090903 0.100656 0.098110 0.100515 0.092183 0.150759 0.085065 0.048262 0.077911 0.091140 0.086792 0.085573 0.063246 0.089919 0.073566 0.114554 0.113287
qa: -0.1031 -0.3259 -0.3177 -0.1786 -0.3726 -0.3399 0.1976 -0.1199 0.0013 -0.1103 0.1233 -0.2610 0.0542 -0.0742 -0.3275 -0.2624 -0.0002 -0.0368 0.0438 0.2783 -0.0777 0.2127 -0.1165 -0.2467 -0.2700 0.1191 0.0821 0.0868 0.1053 0.0784 -0.0151 0.1177 0.1028 0.1029 0.0917 0.0944 0.1011 0.0909 0.1007 0.0981 0.1005 0.0922 0.1508 0.0851 0.0483 0.0779 0.0911 0.0868 0.0856 0.0632 0.0899 0.0736 0.1146 0.1133
va: 1.2335 2.0578 2.0094 3.2200 2.9647 3.0430 3.3815 3.7548 3.6939 3.7946 3.8506 4.0150 3.9760 3.7920 3.9195 3.9034 3.8573 3.8654 3.9499 4.0313 3.8471 3.7986 3.8625 3.8859 3.9212 4.1609 1.0174 1.0141 1.0114 0.9958 0.9890 1.0089 0.9922 1.0002 1.0108 1.0266 1.0007 0.9941 1.0068 1.0072 1.0014 1.0319 1.0465 0.9922 1.0001 1.0191 1.0257 1.0167 1.0082 0.9975 1.0055 0.9955 1.0172 0.9958
dispcorr: -0.034415442 hartree
energy: -1554.044043082515
dipole: -19.44243 19.80813 0.36570 6.67742 -6.90428 -0.22686 6.57986 -5.79292 0.78695
magnitude: 0.89694 au
magnitude: 2.27983 debye
