program: Orca
programVersion: 5.0.2
elementType: Cl O O N N N C C C C C C C C C C C C C C C C C C C C H H H H H H H H H H H H H H H H H H H H H H H H H H H H
charge: 0
multiplicity: 1
keywords: wb97x-d3
keywords: def2-TZVPP
keywords: def2/J RIJCOSX
keywords: DEFGRID2
keywords: scfconv7
keywords: smallprint printgap noloewdin
keywords: NOSOSCF
formula: C20H28ClN3O2
InChI: InChI=1/C20H28ClN3O2/c1-5-17-19(21)20(24-13-23-17)22-10-12-26-18-8-7-16(9-11-25-6-2)14(3)15(18)4/h7-8,13,22H,5-6,9-12H2,1-4H3
54 atoms
Cl -0.087777 -1.681174 0.984077
O  3.165903 2.052321 0.123964
O  -4.399439 0.677597 0.941739
N  2.690635 -0.879527 0.224536
N  2.515235 -1.507253 -1.977157
N  0.556825 -2.507526 -2.841962
C  -0.988675 2.036559 0.357586
C  -0.202269 2.313016 1.481081
C  1.197604 2.291014 1.393511
C  -2.493524 1.996282 0.400036
C  1.805649 2.006943 0.168009
C  -0.348268 1.752168 -0.842594
C  -2.998112 0.675127 0.958922
C  1.027964 1.740963 -0.95194
C  -0.821518 2.626168 2.815177
C  2.02938 2.581395 2.611687
C  3.873724 1.12247 -0.665829
C  3.966584 -0.24406 -0.000184
C  -4.991219 -0.44124 1.546483
C  1.95869 -1.406693 -0.77386
C  0.635775 -1.857207 -0.578236
C  -0.038119 -2.41226 -1.644822
C  -1.452345 -2.902669 -1.58163
C  -4.82621 -1.734911 0.764046
C  -2.40416 -1.922435 -2.263804
C  1.784969 -2.05136 -2.93515
H  -2.886796 2.119173 -0.611837
H  -2.905471 2.822698 0.983395
H  -0.943365 1.539321 -1.723016
H  -2.619391 0.52686 1.982657
H  -2.581864 -0.143194 0.357839
H  1.478679 1.530712 -1.912494
H  -0.41174 3.543897 3.239997
H  -1.899482 2.752823 2.760831
H  -0.628155 1.832278 3.540762
H  3.085873 2.397145 2.441167
H  1.932317 3.625072 2.919917
H  1.716898 1.974448 3.463433
H  3.45858 1.021037 -1.671154
H  4.880632 1.529274 -0.775961
H  4.457181 -0.148589 0.96937
H  4.590158 -0.891047 -0.618386
H  2.212514 -0.673205 1.08465
H  -6.053543 -0.206015 1.639129
H  -4.60521 -0.579009 2.56782
H  -1.766398 -3.079022 -0.553524
H  -1.490009 -3.861538 -2.101072
H  -5.4006 -2.531389 1.238548
H  -5.189192 -1.622131 -0.257946
H  -3.78796 -2.066832 0.720526
H  -3.42436 -2.304878 -2.250534
H  -2.406696 -0.955635 -1.759491
H  -2.114206 -1.763686 -3.301495
H  2.259563 -2.129239 -3.907681
totalener: -1554.00966167 hartree
nucrepener: 2720.53621347 hartree
electener: -4274.54587513 hartree
oneelecener: -7532.28310570 hartree
twoeener: 3257.73723057 hartree
kineticenergy: 1548.46273324 hartree
xcener: -128.892083152886 hartree
chargesum: 0.0000000
charge: -0.102938 -0.325820 -0.317671 -0.178530 -0.372858 -0.339787 0.198311 -0.120045 0.001531 -0.110585 0.123887 -0.262260 0.054249 -0.074149 -0.326751 -0.262451 -0.000063 -0.036684 0.043428 0.278057 -0.078076 0.213769 -0.117286 -0.245771 -0.270309 0.119056 0.082137 0.086726 0.105243 0.078001 -0.014649 0.117764 0.102825 0.091499 0.102725 0.094319 0.100993 0.090831 0.100784 0.098113 0.100439 0.092172 0.150629 0.085053 0.048330 0.077824 0.090991 0.086685 0.085776 0.062505 0.089750 0.074464 0.114454 0.113361
qa: -0.1029 -0.3258 -0.3177 -0.1785 -0.3729 -0.3398 0.1983 -0.1200 0.0015 -0.1106 0.1239 -0.2623 0.0542 -0.0741 -0.3268 -0.2625 -0.0001 -0.0367 0.0434 0.2781 -0.0781 0.2138 -0.1173 -0.2458 -0.2703 0.1191 0.0821 0.0867 0.1052 0.0780 -0.0146 0.1178 0.1028 0.0915 0.1027 0.0943 0.1010 0.0908 0.1008 0.0981 0.1004 0.0922 0.1506 0.0851 0.0483 0.0778 0.0910 0.0867 0.0858 0.0625 0.0898 0.0745 0.1145 0.1134
va: 1.2336 2.0582 2.0093 3.2202 2.9640 3.0427 3.3825 3.7564 3.6941 3.7957 3.8488 4.0163 3.9755 3.7910 3.9191 3.9032 3.8570 3.8654 3.9498 4.0308 3.8475 3.7971 3.8632 3.8856 3.9222 4.1607 1.0174 1.0140 1.0115 0.9957 0.9893 1.0089 1.0002 1.0110 0.9923 1.0266 1.0007 0.9941 1.0068 1.0071 1.0014 1.0318 1.0465 0.9922 1.0001 1.0190 1.0256 1.0166 1.0080 0.9977 1.0056 0.9947 1.0170 0.9958
dispcorr: -0.034350353 hartree
energy: -1554.044012018762
dipole: -19.42583 19.79306 0.36722 6.66825 -6.90300 -0.23474 6.66324 -5.87240 0.79084
magnitude: 0.90299 au
magnitude: 2.29521 debye
