program: Orca
programVersion: 5.0.2
elementType: Cl O O N N N C C C C C C C C C C C C C C C C C C C C H H H H H H H H H H H H H H H H H H H H H H H H H H H H
charge: 0
multiplicity: 1
keywords: wb97x-d3
keywords: def2-TZVPP
keywords: def2/J RIJCOSX
keywords: DEFGRID2
keywords: scfconv7
keywords: smallprint printgap noloewdin
keywords: NOSOSCF
formula: C20H28ClN3O2
InChI: InChI=1/C20H28ClN3O2/c1-5-17-19(21)20(24-13-23-17)22-10-12-26-18-8-7-16(9-11-25-6-2)14(3)15(18)4/h7-8,13,22H,5-6,9-12H2,1-4H3
54 atoms
Cl 0.413579 -1.56159 1.877525
O  2.915841 2.214517 -0.495033
O  -2.820606 0.019797 -0.154533
N  2.57962 -0.670973 -0.005742
N  1.528752 -1.404525 -1.911663
N  -0.547493 -2.534472 -1.838776
C  -1.083902 2.255067 0.638954
C  -0.076857 2.14861 1.602668
C  1.272463 2.132699 1.218154
C  -2.548191 2.175141 0.968732
C  1.60013 2.222184 -0.133575
C  -0.71836 2.36594 -0.697714
C  -3.034181 0.72443 1.036736
C  0.603372 2.356519 -1.08998
C  -0.388949 2.013675 3.066825
C  2.346312 1.992473 2.258943
C  3.327203 1.232564 -1.424783
C  3.669983 -0.086481 -0.746739
C  -3.750796 0.285791 -1.173689
C  1.519588 -1.258664 -0.589041
C  0.426661 -1.746475 0.153608
C  -0.596038 -2.391626 -0.508342
C  -1.754139 -3.027727 0.1948
C  -3.245433 -0.301711 -2.472251
C  -1.410205 -4.45146 0.629288
C  0.499648 -2.029682 -2.45368
H  -3.119821 2.724498 0.21594
H  -2.787344 2.661764 1.916523
H  -1.489665 2.46768 -1.45157
H  -4.094664 0.7030 1.329806
H  -2.474881 0.193658 1.811732
H  0.857421 2.459565 -2.137066
H  -0.086631 1.034681 3.445515
H  0.142967 2.759425 3.660147
H  -1.446327 2.126524 3.289762
H  3.339604 1.957608 1.819822
H  2.337507 2.830762 2.958716
H  2.204595 1.090484 2.860731
H  2.574234 1.060302 -2.197858
H  4.221887 1.619966 -1.917094
H  4.493324 0.059766 -0.046227
H  4.013996 -0.788804 -1.508501
H  2.515008 -0.467519 0.975729
H  -3.907466 1.36571 -1.304477
H  -4.732312 -0.139195 -0.916075
H  -2.592886 -3.046645 -0.499804
H  -2.060473 -2.434371 1.055173
H  -3.971037 -0.128053 -3.267308
H  -2.301829 0.158389 -2.765241
H  -3.075285 -1.374563 -2.392814
H  -2.26987 -4.926532 1.101713
H  -1.120229 -5.060288 -0.2267
H  -0.588905 -4.46306 1.345921
H  0.526434 -2.139523 -3.532881
totalener: -1554.00824725 hartree
nucrepener: 2804.03468985 hartree
electener: -4358.04293710 hartree
oneelecener: -7700.14295953 hartree
twoeener: 3342.10002244 hartree
kineticenergy: 1548.47234317 hartree
xcener: -128.892948741234 hartree
chargesum: 0.0000000
charge: -0.119073 -0.339527 -0.307516 -0.196261 -0.374531 -0.345866 0.275476 -0.180377 -0.034378 -0.202293 0.230535 -0.180233 0.009667 -0.151055 -0.303342 -0.285656 0.025685 -0.069558 -0.002946 0.308018 -0.093680 0.253872 -0.103326 -0.238664 -0.253039 0.120373 0.091184 0.091675 0.099526 0.077544 0.074647 0.105677 0.093060 0.103366 0.083866 0.106068 0.106397 0.080572 0.091172 0.092667 0.101277 0.094493 0.162797 0.068719 0.076538 0.075909 0.062843 0.089101 0.071036 0.088120 0.083345 0.096115 0.080400 0.109583
qa: -0.1191 -0.3395 -0.3075 -0.1963 -0.3745 -0.3459 0.2755 -0.1804 -0.0344 -0.2023 0.2305 -0.1802 0.0097 -0.1511 -0.3033 -0.2857 0.0257 -0.0696 -0.0029 0.3080 -0.0937 0.2539 -0.1033 -0.2387 -0.2530 0.1204 0.0912 0.0917 0.0995 0.0775 0.0746 0.1057 0.0931 0.1034 0.0839 0.1061 0.1064 0.0806 0.0912 0.0927 0.1013 0.0945 0.1628 0.0687 0.0765 0.0759 0.0628 0.0891 0.0710 0.0881 0.0833 0.0961 0.0804 0.1096
va: 1.2254 2.0348 1.9517 3.2090 2.9692 2.9715 3.3102 3.7696 3.7056 3.8719 3.7758 4.0595 3.9096 3.9854 3.9092 3.8934 3.8331 3.8723 3.9151 3.9879 3.9053 3.7495 3.9285 3.9515 3.9345 4.1586 1.0062 1.0151 1.0027 1.0054 0.9969 1.0100 0.9996 1.0017 1.0144 1.0233 1.0058 0.9972 1.0143 1.0078 0.9994 1.0301 1.0371 0.9814 0.9967 1.0201 1.0164 1.0106 1.0072 1.0169 1.0063 1.0071 1.0079 0.9961
dispcorr: -0.036817538 hartree
energy: -1554.045064786832
dipole: -15.22727 15.12439 -0.10287 4.42868 -4.14414 0.28454 -0.00736 0.51994 0.51258
magnitude: 0.59522 au
magnitude: 1.51292 debye
