program: Orca
programVersion: 5.0.2
elementType: Cl O O N N N C C C C C C C C C C C C C C C C C C C C H H H H H H H H H H H H H H H H H H H H H H H H H H H H
charge: 0
multiplicity: 1
keywords: wb97x-d3
keywords: def2-TZVPP
keywords: def2/J RIJCOSX
keywords: DEFGRID2
keywords: scfconv7
keywords: smallprint printgap noloewdin
keywords: NOSOSCF
formula: C20H28ClN3O2
InChI: InChI=1/C20H28ClN3O2/c1-5-17-19(21)20(24-13-23-17)22-10-12-26-18-8-7-16(9-11-25-6-2)14(3)15(18)4/h7-8,13,22H,5-6,9-12H2,1-4H3
54 atoms
Cl -0.571563 -0.376118 -1.713886
O  3.257196 1.81375 0.656442
O  -4.359678 0.639459 1.161547
N  2.402263 -0.128574 -1.428401
N  2.698105 -2.179304 -0.433033
N  0.883711 -3.6269 0.019185
C  -0.781922 1.539122 1.623406
C  -0.284751 2.626346 0.89675
C  1.075144 2.69548 0.559598
C  -2.239582 1.378728 1.967159
C  1.938483 1.674811 0.966724
C  0.105973 0.542247 2.008957
C  -3.016559 0.798471 0.79564
C  1.449904 0.59946 1.69786
C  -1.182895 3.741998 0.438549
C  1.592737 3.867547 -0.227313
C  4.015029 0.681687 0.288102
C  3.764284 0.263694 -1.155312
C  -5.215976 0.317238 0.097967
C  1.876186 -1.277251 -0.962706
C  0.495282 -1.548089 -1.019655
C  0.027931 -2.73482 -0.494768
C  -1.423847 -3.103957 -0.479658
C  -4.941807 -1.031098 -0.551468
C  -1.889105 -3.675118 -1.817539
C  2.157707 -3.299461 0.012017
H  -2.69165 2.323475 2.276166
H  -2.338804 0.70477 2.821142
H  -0.262794 -0.304768 2.575392
H  -2.556893 -0.156783 0.511668
H  -2.921799 1.457755 -0.082048
H  2.102477 -0.193514 2.037398
H  -2.188557 3.668532 0.843468
H  -0.789033 4.716644 0.731222
H  -1.276453 3.756923 -0.650125
H  0.999774 4.038603 -1.12775
H  1.546197 4.789712 0.356679
H  2.626976 3.734557 -0.530647
H  5.061252 0.974916 0.392694
H  3.853701 -0.168302 0.954718
H  4.435284 -0.560389 -1.400604
H  4.004724 1.089557 -1.825993
H  1.753693 0.598634 -1.677602
H  -5.186276 1.102847 -0.67241
H  -6.224625 0.321601 0.515717
H  -2.032076 -2.23663 -0.216385
H  -1.562275 -3.847299 0.305094
H  -4.920923 -1.828792 0.192112
H  -5.731385 -1.262419 -1.267427
H  -3.997646 -1.048971 -1.097939
H  -1.316056 -4.563647 -2.080881
H  -2.94031 -3.95778 -1.764438
H  -1.78042 -2.950926 -2.624156
H  2.84746 -4.028393 0.424259
totalener: -1554.00929674 hartree
nucrepener: 2718.09842575 hartree
electener: -4272.10772249 hartree
oneelecener: -7527.36740742 hartree
twoeener: 3255.25968493 hartree
kineticenergy: 1548.46090994 hartree
xcener: -128.891500956046 hartree
chargesum: 0.0000000
charge: -0.104515 -0.326303 -0.316174 -0.180202 -0.371045 -0.326060 0.182073 -0.133691 0.012699 -0.101418 0.105661 -0.257286 0.056028 -0.053891 -0.324041 -0.261402 0.000212 -0.035912 0.039309 0.254711 -0.063910 0.196817 -0.075874 -0.255798 -0.268522 0.122647 0.084216 0.078990 0.105951 0.003369 0.066054 0.118349 0.091768 0.103510 0.101844 0.089772 0.100973 0.095250 0.097633 0.100375 0.092662 0.099916 0.150621 0.051084 0.084650 0.042184 0.091268 0.092463 0.088488 0.064975 0.103549 0.087942 0.083201 0.114831
qa: -0.1045 -0.3263 -0.3162 -0.1802 -0.3710 -0.3261 0.1821 -0.1337 0.0127 -0.1014 0.1057 -0.2573 0.0560 -0.0539 -0.3240 -0.2614 0.0002 -0.0359 0.0393 0.2547 -0.0639 0.1968 -0.0759 -0.2558 -0.2685 0.1226 0.0842 0.0790 0.1060 0.0034 0.0661 0.1183 0.0918 0.1035 0.1018 0.0898 0.1010 0.0953 0.0976 0.1004 0.0927 0.0999 0.1506 0.0511 0.0846 0.0422 0.0913 0.0925 0.0885 0.0650 0.1035 0.0879 0.0832 0.1148
va: 1.2340 2.0569 2.0215 3.2190 2.9649 3.0495 3.4208 3.7571 3.6809 3.8097 3.8647 4.0136 4.0014 3.7670 3.9164 3.9024 3.8562 3.8677 3.9501 4.0618 3.8422 3.8296 3.8949 3.8762 3.9144 4.1516 1.0136 1.0191 1.0122 0.9709 0.9885 1.0074 1.0116 1.0002 0.9930 0.9945 1.0010 1.0264 1.0074 1.0070 1.0310 1.0016 1.0462 0.9992 0.9933 0.9998 1.0349 1.0047 1.0150 0.9963 1.0067 1.0048 1.0096 0.9962
dispcorr: -0.033927968 hartree
energy: -1554.043224704795
dipole: -19.01067 19.12318 0.11250 6.44661 -5.96790 0.47872 0.61588 -1.44420 -0.82831
magnitude: 0.96329 au
magnitude: 2.44848 debye
