program: Orca
programVersion: 5.0.2
elementType: Cl O O N N N C C C C C C C C C C C C C C C C C C C C H H H H H H H H H H H H H H H H H H H H H H H H H H H H
charge: 0
multiplicity: 1
keywords: wb97x-d3
keywords: def2-TZVPP
keywords: def2/J RIJCOSX
keywords: DEFGRID2
keywords: scfconv7
keywords: smallprint printgap noloewdin
keywords: NOSOSCF
formula: C20H28ClN3O2
InChI: InChI=1/C20H28ClN3O2/c1-5-17-19(21)20(24-13-23-17)22-10-12-26-18-8-7-16(9-11-25-6-2)14(3)15(18)4/h7-8,13,22H,5-6,9-12H2,1-4H3
54 atoms
Cl 0.265251 -2.07874 1.472468
O  3.25504 2.16693 0.412499
O  -4.209174 0.13001 1.006899
N  2.880165 -0.920885 0.560915
N  2.265992 -0.720998 -1.651267
N  0.102425 -1.302891 -2.406695
C  -0.860843 1.600103 0.270452
C  -0.155056 2.033773 -0.860184
C  1.232275 2.215991 -0.811601
C  -2.329704 1.282639 0.16085
C  1.90025 1.999024 0.396413
C  -0.170701 1.444641 1.463994
C  -2.920789 0.554809 1.353408
C  1.193663 1.654866 1.537447
C  -0.895965 2.258876 -2.149752
C  1.996269 2.628078 -2.03863
C  4.053467 1.219228 1.077923
C  4.093291 -0.153976 0.413678
C  -4.857396 -0.577875 2.028361
C  1.952824 -1.064939 -0.406888
C  0.671049 -1.586065 -0.13869
C  -0.242055 -1.675978 -1.168601
C  -1.628317 -2.216441 -0.989299
C  -6.220193 -1.013516 1.538705
C  -1.651775 -3.742997 -1.056871
C  1.332282 -0.862679 -2.57125
H  -2.493222 0.656728 -0.721445
H  -2.90762 2.196455 -0.014994
H  -0.68956 1.142207 2.363791
H  -2.950582 1.213382 2.235537
H  -2.289058 -0.305091 1.625161
H  1.696928 1.534034 2.488179
H  -1.018527 1.324198 -2.704463
H  -1.892913 2.66241 -1.977735
H  -0.380755 2.958988 -2.803204
H  1.717498 2.027334 -2.903751
H  1.798938 3.671941 -2.29375
H  3.067708 2.523772 -1.902052
H  5.064051 1.632167 1.065099
H  3.776267 1.116199 2.134816
H  4.921378 -0.713907 0.8591
H  4.306472 -0.052342 -0.648726
H  2.579992 -1.123991 1.499391
H  -4.962145 0.045539 2.929157
H  -4.2666 -1.457773 2.32601
H  -2.245628 -1.804522 -1.787429
H  -2.055736 -1.882467 -0.04322
H  -6.742356 -1.565118 2.320383
H  -6.833112 -0.154988 1.265544
H  -6.135574 -1.662172 0.667155
H  -2.673357 -4.111693 -0.966926
H  -1.249986 -4.096839 -2.005783
H  -1.065018 -4.188042 -0.25389
H  1.612074 -0.57559 -3.579729
totalener: -1554.00587144 hartree
nucrepener: 2767.83366621 hartree
electener: -4321.83953764 hartree
oneelecener: -7627.33270239 hartree
twoeener: 3305.49316475 hartree
kineticenergy: 1548.46593887 hartree
xcener: -128.896484400931 hartree
chargesum: -0.0000000
charge: -0.108739 -0.322204 -0.311599 -0.175751 -0.336947 -0.324743 0.086012 -0.119785 0.034445 -0.096829 0.274632 -0.204711 -0.026465 -0.192005 -0.308538 -0.262973 -0.005795 -0.043500 0.042405 0.242431 -0.019738 0.176084 -0.131781 -0.240401 -0.258389 0.102764 0.086673 0.090912 0.098437 0.088519 0.050375 0.108941 0.107700 0.101812 0.096763 0.085998 0.103602 0.098144 0.098475 0.070234 0.097621 0.105116 0.133681 0.061225 0.055671 0.096744 0.071231 0.072159 0.083026 0.081847 0.086629 0.098075 0.082148 0.120360
qa: -0.1087 -0.3222 -0.3116 -0.1758 -0.3369 -0.3247 0.0860 -0.1198 0.0344 -0.0968 0.2746 -0.2047 -0.0265 -0.1920 -0.3085 -0.2630 -0.0058 -0.0435 0.0424 0.2424 -0.0197 0.1761 -0.1318 -0.2404 -0.2584 0.1028 0.0867 0.0909 0.0984 0.0885 0.0504 0.1089 0.1077 0.1018 0.0968 0.0860 0.1036 0.0981 0.0985 0.0702 0.0976 0.1051 0.1337 0.0612 0.0557 0.0967 0.0712 0.0722 0.0830 0.0818 0.0866 0.0981 0.0821 0.1204
va: 1.2297 2.0639 1.9869 3.2050 2.9772 2.9790 3.5105 3.7674 3.6516 3.7752 3.6584 3.9098 3.9733 3.9569 3.9181 3.9169 3.9288 3.8337 3.9157 4.1582 3.8486 3.8124 3.8959 3.9705 3.9439 4.1246 1.0071 1.0092 1.0182 0.9961 0.9921 1.0095 1.0049 1.0018 1.0018 0.9931 0.9975 1.0256 1.0097 0.9952 1.0068 1.0361 1.0584 0.9904 0.9860 1.0221 1.0013 1.0089 1.0071 1.0062 1.0056 1.0062 1.0082 0.9954
dispcorr: -0.036292007 hartree
energy: -1554.042163443981
dipole: -21.47319 21.90466 0.43148 4.09588 -4.45236 -0.35648 -2.86138 3.92436 1.06299
magnitude: 1.20133 au
magnitude: 3.05354 debye
