program: Orca
programVersion: 5.0.2
elementType: Cl O O N N N C C C C C C C C C C C C C C C C C C C C H H H H H H H H H H H H H H H H H H H H H H H H H H H H
charge: 0
multiplicity: 1
keywords: wb97x-d3
keywords: def2-TZVPP
keywords: def2/J RIJCOSX
keywords: DEFGRID2
keywords: scfconv7
keywords: smallprint printgap noloewdin
keywords: NOSOSCF
formula: C20H28ClN3O2
InChI: InChI=1/C20H28ClN3O2/c1-5-17-19(21)20(24-13-23-17)22-10-12-26-18-8-7-16(9-11-25-6-2)14(3)15(18)4/h7-8,13,22H,5-6,9-12H2,1-4H3
54 atoms
Cl 2.829595 -2.938086 -0.527433
O  2.950215 1.780104 -0.505103
O  -4.716766 1.622965 0.429576
N  2.962596 -0.49397 1.203117
N  0.701055 -0.423554 1.647376
N  -0.807451 -1.993481 0.72505
C  -1.16509 2.33305 -0.417566
C  -0.578014 1.42526 -1.308738
C  0.809643 1.236589 -1.316648
C  -2.654647 2.535696 -0.331755
C  1.604579 1.980098 -0.442347
C  -0.341069 3.054856 0.435505
C  -3.333032 1.412665 0.4377
C  1.031106 2.893794 0.428364
C  -1.415095 0.614785 -2.25971
C  1.438509 0.251037 -2.259943
C  3.699976 1.803329 0.682767
C  3.207105 0.81774 1.742837
C  -5.43182 0.638297 1.126036
C  1.727208 -1.011036 1.042024
C  1.497424 -2.164782 0.267439
C  0.206811 -2.633748 0.133233
C  -0.141783 -3.83589 -0.691281
C  -6.909853 0.950312 1.04989
C  -0.330851 -3.482011 -2.164673
C  -0.496137 -0.934482 1.446338
H  -3.105267 2.615547 -1.323795
H  -2.865881 3.482343 0.170323
H  -0.783633 3.767687 1.120936
H  -2.941656 1.393553 1.46726
H  -3.079339 0.437746 -0.006417
H  1.640986 3.489261 1.095739
H  -1.477544 -0.427493 -1.937595
H  -2.434494 0.983431 -2.340618
H  -0.993623 0.614671 -3.26516
H  0.849019 -0.661743 -2.334553
H  1.518814 0.66414 -3.268894
H  2.44067 -0.031666 -1.949656
H  4.716817 1.549003 0.374916
H  3.753016 2.804694 1.128782
H  2.28309 1.159186 2.204437
H  3.960777 0.768698 2.534752
H  3.710362 -0.938495 0.697824
H  -5.111159 0.596383 2.178042
H  -5.2351 -0.357956 0.702308
H  -1.069129 -4.246332 -0.292677
H  0.625979 -4.604117 -0.5927
H  -7.130274 1.922356 1.490633
H  -7.258145 0.958423 0.017336
H  -7.481268 0.197267 1.59226
H  -0.62844 -4.36196 -2.734413
H  -1.109028 -2.729369 -2.287635
H  0.587876 -3.097122 -2.606253
H  -1.317757 -0.423552 1.935842
totalener: -1554.00927132 hartree
nucrepener: 2699.30116606 hartree
electener: -4253.31043737 hartree
oneelecener: -7490.18291596 hartree
twoeener: 3236.87247859 hartree
kineticenergy: 1548.47153718 hartree
xcener: -128.893494847393 hartree
chargesum: 0.0000000
charge: -0.095215 -0.318726 -0.315367 -0.173450 -0.322735 -0.321283 0.080063 -0.124037 0.042831 -0.086675 0.235595 -0.148925 -0.002781 -0.159057 -0.329519 -0.273210 -0.018708 -0.072893 0.055576 0.266448 -0.107796 0.175513 -0.099864 -0.237160 -0.293418 0.122878 0.084531 0.074032 0.102055 0.059850 0.073517 0.110885 0.093298 0.099889 0.108511 0.071736 0.114906 0.081803 0.097737 0.083224 0.121796 0.105119 0.133302 0.053150 0.059548 0.086475 0.078968 0.080726 0.081029 0.071483 0.100105 0.101484 0.082584 0.110167
qa: -0.0952 -0.3187 -0.3154 -0.1734 -0.3227 -0.3213 0.0801 -0.1240 0.0428 -0.0867 0.2356 -0.1489 -0.0028 -0.1591 -0.3295 -0.2732 -0.0187 -0.0729 0.0556 0.2664 -0.1078 0.1755 -0.0999 -0.2372 -0.2934 0.1229 0.0845 0.0740 0.1021 0.0599 0.0735 0.1109 0.0933 0.0999 0.1085 0.0717 0.1149 0.0818 0.0977 0.0832 0.1218 0.1051 0.1333 0.0532 0.0595 0.0865 0.0790 0.0807 0.0810 0.0715 0.1001 0.1015 0.0826 0.1102
va: 1.2493 2.0700 2.0074 3.2017 2.9813 3.0034 3.5792 3.6642 3.6105 3.7766 3.8050 4.0577 3.9850 3.9039 3.9165 3.9231 3.9402 3.8127 3.9070 4.0728 3.8379 3.8293 3.8435 3.9631 3.9329 4.1210 1.0165 1.0190 1.0106 0.9966 0.9860 1.0058 0.9983 1.0116 0.9992 0.9897 1.0000 1.0327 0.9958 0.9991 1.0349 1.0105 1.0586 0.9895 0.9892 1.0263 1.0137 1.0072 1.0069 1.0089 1.0102 0.9968 1.0039 1.0035
dispcorr: -0.034378239 hartree
energy: -1554.043649555140
dipole: -29.54778 30.48116 0.93339 8.51396 -8.77197 -0.25801 -4.79119 5.08393 0.29274
magnitude: 1.01167 au
magnitude: 2.57147 debye
