program: Orca
programVersion: 5.0.2
elementType: Cl O O N N N C C C C C C C C C C C C C C C C C C C C H H H H H H H H H H H H H H H H H H H H H H H H H H H H
charge: 0
multiplicity: 1
keywords: wb97x-d3
keywords: def2-TZVPP
keywords: def2/J RIJCOSX
keywords: DEFGRID2
keywords: scfconv7
keywords: smallprint printgap noloewdin
keywords: NOSOSCF
formula: C20H28ClN3O2
InChI: InChI=1/C20H28ClN3O2/c1-5-17-19(21)20(24-13-23-17)22-10-12-26-18-8-7-16(9-11-25-6-2)14(3)15(18)4/h7-8,13,22H,5-6,9-12H2,1-4H3
54 atoms
Cl 2.516916 -2.729482 -0.977555
O  2.895228 1.712609 0.130967
O  -3.637793 1.181678 0.996195
N  2.617009 -0.822589 1.354072
N  0.335478 -0.560018 1.49286
N  -1.149281 -1.529132 -0.066828
C  -1.168245 2.395208 -0.395257
C  -0.410524 1.727031 -1.367525
C  0.95319 1.487585 -1.164181
C  -2.637747 2.673746 -0.577647
C  1.56002 1.94642 0.00819
C  -0.532989 2.822837 0.761991
C  -3.54832 1.471466 -0.372478
C  0.818407 2.614107 0.969225
C  -1.039328 1.227664 -2.639179
C  1.760243 0.751375 -2.196863
C  3.468841 1.507052 1.394824
C  2.865215 0.333562 2.177282
C  -4.451288 0.067738 1.263275
C  1.380368 -1.111391 0.887954
C  1.164032 -1.969696 -0.204572
C  -0.125829 -2.140197 -0.670139
C  -0.456294 -3.011967 -1.843671
C  -4.522935 -0.149859 2.758263
C  -0.610867 -4.475642 -1.434279
C  -0.856917 -0.782487 0.983065
H  -2.827204 3.074512 -1.576652
H  -2.951178 3.458966 0.114385
H  -1.109318 3.335108 1.522293
H  -3.171148 0.60196 -0.929076
H  -4.546182 1.701519 -0.778087
H  1.27712 2.972677 1.881655
H  -0.39909 1.405183 -3.503038
H  -1.22193 0.150661 -2.587958
H  -1.994916 1.701641 -2.850829
H  2.691033 0.365822 -1.790685
H  1.208752 -0.094535 -2.606267
H  2.020477 1.40248 -3.035807
H  4.52333 1.313995 1.186053
H  3.436489 2.406077 2.023603
H  1.920804 0.609138 2.640071
H  3.555743 0.077921 2.98577
H  3.39261 -1.197729 0.834002
H  -4.052226 -0.829027 0.767067
H  -5.463858 0.226716 0.861388
H  0.308656 -2.922912 -2.617083
H  -1.394023 -2.649446 -2.265367
H  -4.944474 0.718121 3.264551
H  -5.153983 -1.01024 2.980939
H  -3.536473 -0.34217 3.180668
H  0.31879 -4.877733 -1.032756
H  -1.383381 -4.584659 -0.673762
H  -0.895144 -5.085663 -2.291436
H  -1.680228 -0.276279 1.469956
totalener: -1554.00788629 hartree
nucrepener: 2775.64590060 hartree
electener: -4329.65378689 hartree
oneelecener: -7643.46350595 hartree
twoeener: 3313.80971906 hartree
kineticenergy: 1548.46658598 hartree
xcener: -128.895126251636 hartree
chargesum: -0.0000000
charge: -0.097926 -0.318046 -0.323587 -0.174830 -0.330117 -0.319368 0.148948 -0.151728 0.081771 -0.164131 0.207505 -0.152375 -0.001019 -0.128420 -0.325078 -0.289773 -0.024243 -0.068804 0.003598 0.230625 -0.069270 0.142310 -0.116965 -0.229231 -0.252380 0.164236 0.093187 0.078123 0.098907 0.084957 0.073026 0.100931 0.104856 0.099937 0.090709 0.081688 0.084536 0.111903 0.100154 0.083021 0.118556 0.103984 0.130417 0.078815 0.077228 0.075269 0.084873 0.081537 0.074518 0.078274 0.082284 0.095605 0.085860 0.105144
qa: -0.0979 -0.3180 -0.3236 -0.1748 -0.3301 -0.3194 0.1489 -0.1517 0.0818 -0.1641 0.2075 -0.1524 -0.0010 -0.1284 -0.3251 -0.2898 -0.0242 -0.0688 0.0036 0.2306 -0.0693 0.1423 -0.1170 -0.2292 -0.2524 0.1642 0.0932 0.0781 0.0989 0.0850 0.0730 0.1009 0.1049 0.0999 0.0907 0.0817 0.0845 0.1119 0.1002 0.0830 0.1186 0.1040 0.1304 0.0788 0.0772 0.0753 0.0849 0.0815 0.0745 0.0783 0.0823 0.0956 0.0859 0.1051
va: 1.2475 2.0752 1.9562 3.1992 3.0106 2.9552 3.4615 3.6845 3.5619 3.8978 3.8012 4.0557 3.8922 3.8927 3.9273 3.9381 3.9329 3.8127 3.8903 4.1180 3.8477 3.8608 3.8548 3.9519 3.9316 4.0726 1.0013 1.0229 1.0144 0.9927 1.0020 1.0097 0.9998 0.9902 1.0099 1.0312 0.9905 0.9997 0.9939 0.9987 1.0338 1.0096 1.0588 0.9972 0.9964 1.0150 1.0244 1.0070 1.0093 1.0063 1.0084 1.0059 1.0059 1.0269
dispcorr: -0.036510212 hartree
energy: -1554.044396503703
dipole: -24.32361 24.76322 0.43961 5.29882 -5.50813 -0.20931 -1.27517 1.28586 0.01069
magnitude: 0.48701 au
magnitude: 1.23788 debye
