program: Orca
programVersion: 5.0.2
elementType: Cl O O N N N C C C C C C C C C C C C C C C C C C C C H H H H H H H H H H H H H H H H H H H H H H H H H H H H
charge: 0
multiplicity: 1
keywords: wb97x-d3
keywords: def2-TZVPP
keywords: def2/J RIJCOSX
keywords: DEFGRID2
keywords: scfconv7
keywords: smallprint printgap noloewdin
keywords: NOSOSCF
formula: C20H28ClN3O2
InChI: InChI=1/C20H28ClN3O2/c1-5-17-19(21)20(24-13-23-17)22-10-12-26-18-8-7-16(9-11-25-6-2)14(3)15(18)4/h7-8,13,22H,5-6,9-12H2,1-4H3
54 atoms
Cl 0.218443 -1.184886 -2.439627
O  3.236952 1.951823 0.518069
O  -4.35927 0.886065 -0.399702
N  2.840075 -0.564729 -1.124006
N  2.253925 -1.408671 0.93857
N  0.128447 -2.361529 1.342277
C  -0.898084 2.122379 0.137556
C  -0.297104 1.776727 1.354224
C  1.098358 1.698608 1.46037
C  -2.390657 2.175365 -0.050073
C  1.887027 1.986267 0.343648
C  -0.081754 2.394967 -0.951721
C  -2.970217 0.783771 -0.243206
C  1.295311 2.338815 -0.861342
C  -1.121581 1.461452 2.572522
C  1.744102 1.337285 2.767768
C  4.07542 1.504006 -0.515864
C  4.089021 -0.012507 -0.6631
C  -5.021811 -0.341062 -0.55418
C  1.927766 -1.147728 -0.322268
C  0.649449 -1.511515 -0.793352
C  -0.22753 -2.129366 0.072773
C  -1.574118 -2.634932 -0.34507
C  -5.174573 -1.122236 0.741464
C  -1.479184 -4.055672 -0.899574
C  1.341127 -1.989692 1.692603
H  -2.627839 2.781518 -0.927154
H  -2.886308 2.660325 0.793958
H  -0.534795 2.671074 -1.896428
H  -2.698979 0.152154 0.614494
H  -2.506872 0.320616 -1.128498
H  1.889794 2.592063 -1.729083
H  -2.17241 1.708947 2.445977
H  -1.069463 0.397961 2.819242
H  -0.766055 2.007983 3.446777
H  1.77676 2.197706 3.441357
H  1.1938 0.550674 3.282419
H  2.762834 0.987288 2.633969
H  3.840752 1.975844 -1.476877
H  5.081123 1.834342 -0.248091
H  4.335204 -0.477107 0.2894
H  4.879279 -0.279953 -1.370941
H  2.53124 -0.30929 -2.046411
H  -4.518033 -0.964838 -1.307911
H  -6.010712 -0.104234 -0.952697
H  -2.027022 -1.977923 -1.087623
H  -2.216281 -2.629198 0.535771
H  -5.766481 -2.021855 0.568226
H  -4.216508 -1.439861 1.154024
H  -5.68496 -0.525362 1.49743
H  -1.04524 -4.731551 -0.163587
H  -2.46852 -4.431968 -1.158534
H  -0.863465 -4.09172 -1.798165
H  1.627952 -2.182027 2.721146
totalener: -1554.00710977 hartree
nucrepener: 2759.05307159 hartree
electener: -4313.06018136 hartree
oneelecener: -7609.63210365 hartree
twoeener: 3296.57192229 hartree
kineticenergy: 1548.46912776 hartree
xcener: -128.894251648997 hartree
chargesum: -0.0000000
charge: -0.102128 -0.313975 -0.316556 -0.182973 -0.347276 -0.328326 0.174428 -0.199572 0.070472 -0.094008 0.222465 -0.215897 0.021352 -0.166029 -0.322685 -0.279138 -0.017702 -0.032371 0.038214 0.288708 -0.091657 0.233734 -0.155734 -0.243906 -0.254009 0.100997 0.074962 0.083851 0.099682 0.049491 0.057518 0.109472 0.090955 0.102134 0.108735 0.108745 0.086108 0.105532 0.076486 0.099251 0.104604 0.096658 0.135531 0.047825 0.089991 0.059044 0.099676 0.080013 0.065597 0.091515 0.099879 0.085023 0.084966 0.120327
qa: -0.1021 -0.3140 -0.3166 -0.1830 -0.3473 -0.3283 0.1744 -0.1996 0.0705 -0.0940 0.2225 -0.2159 0.0214 -0.1660 -0.3227 -0.2791 -0.0177 -0.0324 0.0382 0.2887 -0.0917 0.2337 -0.1557 -0.2439 -0.2540 0.1010 0.0750 0.0839 0.0997 0.0495 0.0575 0.1095 0.0910 0.1021 0.1087 0.1087 0.0861 0.1055 0.0765 0.0993 0.1046 0.0967 0.1355 0.0478 0.0900 0.0590 0.0997 0.0800 0.0656 0.0915 0.0999 0.0850 0.0850 0.1203
va: 1.2327 2.0783 2.0078 3.2116 2.9721 2.9883 3.4530 3.7415 3.5882 3.7959 3.7305 4.0208 3.9986 3.8876 3.9193 3.9139 3.9463 3.8240 3.9407 4.0705 3.8492 3.7409 3.8868 3.8873 3.9425 4.1374 1.0203 1.0156 1.0140 0.9667 1.0003 1.0093 1.0113 0.9977 0.9976 0.9982 0.9933 1.0217 0.9946 1.0092 1.0351 1.0077 1.0578 0.9976 0.9934 1.0172 1.0176 1.0131 1.0075 1.0104 1.0068 1.0065 1.0067 0.9956
dispcorr: -0.035936858 hartree
energy: -1554.043046629977
dipole: -19.52846 20.16248 0.63402 -1.18319 0.94565 -0.23753 11.68122 -12.46524 -0.78403
magnitude: 1.03591 au
magnitude: 2.63307 debye
