program: Orca
programVersion: 5.0.2
elementType: Cl O O N N N C C C C C C C C C C C C C C C C C C C C H H H H H H H H H H H H H H H H H H H H H H H H H H H H
charge: 0
multiplicity: 1
keywords: wb97x-d3
keywords: def2-TZVPP
keywords: def2/J RIJCOSX
keywords: DEFGRID2
keywords: scfconv7
keywords: smallprint printgap noloewdin
keywords: NOSOSCF
formula: C20H28ClN3O2
InChI: InChI=1/C20H28ClN3O2/c1-5-17-19(21)20(24-13-23-17)22-10-12-26-18-8-7-16(9-11-25-6-2)14(3)15(18)4/h7-8,13,22H,5-6,9-12H2,1-4H3
54 atoms
Cl 0.304874 -1.967454 1.578028
O  3.186289 1.998632 -0.166457
O  -4.211811 0.507905 1.469137
N  2.884216 -0.91501 0.462426
N  2.2181 -1.010726 -1.74184
N  0.051066 -1.717466 -2.363923
C  -0.859328 1.965991 0.799236
C  -0.434412 2.051898 -0.531809
C  0.93277 2.050443 -0.844927
C  -2.310179 1.91873 1.199461
C  1.871156 1.959257 0.185853
C  0.103602 1.886825 1.796647
C  -2.879031 0.518156 1.036577
C  1.453728 1.886245 1.507864
C  -1.421954 2.133463 -1.663437
C  1.38542 2.183713 -2.271403
C  4.127479 1.236976 0.546339
C  4.119773 -0.237869 0.160721
C  -4.901143 -0.685901 1.208487
C  1.936131 -1.190858 -0.455247
C  0.667887 -1.684206 -0.091734
C  -0.259277 -1.937818 -1.083207
C  -1.623773 -2.489558 -0.784471
C  -4.492913 -1.849572 2.098674
C  -2.626692 -2.30943 -1.91146
C  1.267814 -1.280803 -2.613527
H  -2.913868 2.628684 0.629968
H  -2.406198 2.214468 2.246656
H  -0.211147 1.831192 2.831966
H  -2.253879 -0.18193 1.608051
H  -2.810422 0.209605 -0.018763
H  2.164236 1.851641 2.323074
H  -2.443034 2.281976 -1.321203
H  -1.1871 2.956658 -2.339408
H  -1.412297 1.219341 -2.262939
H  0.763879 1.59733 -2.946931
H  1.324025 3.223855 -2.602988
H  2.412208 1.857484 -2.40541
H  5.104996 1.65264 0.293397
H  4.017491 1.348035 1.630792
H  4.939846 -0.732178 0.690543
H  4.310247 -0.344926 -0.905032
H  2.606321 -0.972082 1.427577
H  -4.789754 -0.973599 0.151856
H  -5.959046 -0.464211 1.364857
H  -2.005868 -2.034452 0.129792
H  -1.512229 -3.553273 -0.548307
H  -3.461542 -2.163732 1.932935
H  -4.601045 -1.592576 3.152506
H  -5.12914 -2.712181 1.896659
H  -3.59072 -2.726163 -1.619334
H  -2.775037 -1.254693 -2.14412
H  -2.302153 -2.801126 -2.825273
H  1.518924 -1.118087 -3.65646
totalener: -1554.00657312 hartree
nucrepener: 2773.10763994 hartree
electener: -4327.11421306 hartree
oneelecener: -7637.70217018 hartree
twoeener: 3310.58795711 hartree
kineticenergy: 1548.46637730 hartree
xcener: -128.897269017663 hartree
chargesum: 0.0000000
charge: -0.101816 -0.313854 -0.317365 -0.182922 -0.350121 -0.336715 0.174961 -0.199449 0.070155 -0.108646 0.229574 -0.200466 0.056209 -0.184366 -0.320608 -0.285823 -0.020475 -0.027388 0.033953 0.291466 -0.096600 0.196399 -0.050973 -0.246420 -0.262156 0.094448 0.085555 0.075499 0.099907 0.053357 0.023904 0.113386 0.092578 0.110298 0.093721 0.089185 0.109628 0.107507 0.099163 0.078301 0.094500 0.103752 0.137421 0.050180 0.090147 0.011264 0.102790 0.074315 0.091559 0.080640 0.085779 0.082635 0.102365 0.119660
qa: -0.1018 -0.3139 -0.3174 -0.1829 -0.3501 -0.3367 0.1750 -0.1994 0.0702 -0.1086 0.2296 -0.2005 0.0562 -0.1844 -0.3206 -0.2858 -0.0205 -0.0274 0.0340 0.2915 -0.0966 0.1964 -0.0510 -0.2464 -0.2622 0.0944 0.0856 0.0755 0.0999 0.0534 0.0239 0.1134 0.0926 0.1103 0.0937 0.0892 0.1096 0.1075 0.0992 0.0783 0.0945 0.1038 0.1374 0.0502 0.0901 0.0113 0.1028 0.0743 0.0916 0.0806 0.0858 0.0826 0.1024 0.1197
va: 1.2391 2.0775 2.0180 3.2118 2.9741 2.9623 3.4554 3.7203 3.5924 3.8242 3.7413 4.0180 3.9848 3.8881 3.9253 3.9184 3.9476 3.8208 3.9436 4.0561 3.8900 3.7935 3.8866 3.8822 3.9390 4.1516 1.0127 1.0196 1.0130 0.9921 0.9922 1.0083 1.0086 0.9986 1.0000 0.9911 0.9981 1.0216 1.0088 0.9940 1.0079 1.0369 1.0563 0.9993 0.9951 1.0206 1.0074 0.9948 1.0095 1.0134 1.0036 0.9993 1.0221 0.9950
dispcorr: -0.036905935 hartree
energy: -1554.043479055702
dipole: -21.36589 22.01950 0.65361 4.21468 -4.65479 -0.44010 -5.32603 5.92142 0.59539
magnitude: 0.98762 au
magnitude: 2.51032 debye
