program: Orca
programVersion: 5.0.2
elementType: Cl O O N N N C C C C C C C C C C C C C C C C C C C C H H H H H H H H H H H H H H H H H H H H H H H H H H H H
charge: 0
multiplicity: 1
keywords: wb97x-d3
keywords: def2-TZVPP
keywords: def2/J RIJCOSX
keywords: DEFGRID2
keywords: scfconv7
keywords: smallprint printgap noloewdin
keywords: NOSOSCF
formula: C20H28ClN3O2
InChI: InChI=1/C20H28ClN3O2/c1-5-17-19(21)20(24-13-23-17)22-10-12-26-18-8-7-16(9-11-25-6-2)14(3)15(18)4/h7-8,13,22H,5-6,9-12H2,1-4H3
54 atoms
Cl 0.718464 0.30742 -2.57671
O  3.049471 1.263251 1.656826
O  -3.350755 -0.242112 0.862722
N  2.888552 -0.467804 -0.670108
N  1.697551 -2.130819 0.37119
N  -0.535121 -2.625109 -0.22012
C  -0.996849 1.715682 0.798719
C  -0.030436 2.470825 0.11896
C  1.331826 2.312178 0.399536
C  -2.457704 1.933432 0.48677
C  1.718544 1.391404 1.377278
C  -0.575758 0.808953 1.760446
C  -3.451182 1.095379 1.264147
C  0.764585 0.654962 2.061051
C  -0.484334 3.441358 -0.935898
C  2.374779 3.099333 -0.347041
C  3.595496 -0.038276 1.685918
C  3.961719 -0.539482 0.29214
C  -4.133946 -1.129002 1.617969
C  1.746769 -1.172161 -0.547853
C  0.623231 -0.927769 -1.364115
C  -0.518001 -1.676917 -1.166888
C  -1.782395 -1.496204 -1.95079
C  -4.039155 -2.511786 1.012292
C  -2.354366 -2.814919 -2.457496
C  0.562182 -2.796419 0.479988
H  -2.640962 1.776121 -0.581554
H  -2.710349 2.98368 0.669466
H  -1.289111 0.198067 2.294506
H  -4.465412 1.47855 1.076444
H  -3.276331 1.201839 2.345818
H  1.056678 -0.047803 2.829952
H  -1.155699 4.19754 -0.522976
H  0.338072 3.970494 -1.407945
H  -1.033897 2.931762 -1.730134
H  3.379212 2.858892 -0.010485
H  2.325308 2.908849 -1.421932
H  2.243981 4.173901 -0.210019
H  4.504903 0.016602 2.287995
H  2.92797 -0.753855 2.16854
H  4.318977 -1.567858 0.378927
H  4.782579 0.053937 -0.111563
H  2.862343 0.33762 -1.270116
H  -5.182834 -0.797243 1.642434
H  -3.788481 -1.147876 2.66264
H  -1.625186 -0.814139 -2.784688
H  -2.501312 -1.014619 -1.283783
H  -4.582446 -3.228186 1.628844
H  -4.474404 -2.533769 0.012739
H  -3.001427 -2.836726 0.934696
H  -1.671737 -3.303753 -3.152874
H  -2.545428 -3.502346 -1.636304
H  -3.293719 -2.640251 -2.982045
H  0.538642 -3.574607 1.236013
totalener: -1554.00865957 hartree
nucrepener: 2801.90142422 hartree
electener: -4355.91008379 hartree
oneelecener: -7696.03063757 hartree
twoeener: 3340.12055378 hartree
kineticenergy: 1548.46836340 hartree
xcener: -128.898130425570 hartree
chargesum: -0.0000000
charge: -0.110375 -0.338859 -0.310236 -0.189317 -0.368671 -0.363719 0.060600 -0.149892 0.007201 -0.110527 0.296275 -0.118289 -0.047739 -0.182249 -0.284162 -0.307146 0.018194 -0.062318 0.050617 0.275989 -0.074104 0.260392 -0.108458 -0.267049 -0.267443 0.122945 0.080895 0.088700 0.098685 0.086987 0.083859 0.103274 0.103164 0.089922 0.088892 0.105195 0.082984 0.107947 0.094616 0.096840 0.092098 0.097416 0.153655 0.060931 0.057697 0.080125 0.083417 0.087241 0.076662 0.098946 0.087195 0.092370 0.083593 0.105035
qa: -0.1104 -0.3389 -0.3102 -0.1893 -0.3687 -0.3637 0.0606 -0.1499 0.0072 -0.1105 0.2963 -0.1183 -0.0477 -0.1822 -0.2842 -0.3071 0.0182 -0.0623 0.0506 0.2760 -0.0741 0.2604 -0.1085 -0.2670 -0.2674 0.1229 0.0809 0.0887 0.0987 0.0870 0.0839 0.1033 0.1032 0.0899 0.0889 0.1052 0.0830 0.1079 0.0946 0.0968 0.0921 0.0974 0.1537 0.0609 0.0577 0.0801 0.0834 0.0872 0.0767 0.0989 0.0872 0.0924 0.0836 0.1050
va: 1.2315 2.0448 1.9677 3.2051 2.9789 2.9433 3.5722 3.7178 3.6160 3.8952 3.6781 3.8569 3.9851 3.9656 3.9123 3.9097 3.8338 3.8838 3.8999 4.0648 3.9008 3.7166 3.8316 3.9439 3.9411 4.1617 1.0052 1.0037 1.0100 0.9987 0.9854 1.0114 0.9998 1.0043 1.0037 1.0256 0.9938 0.9994 1.0067 1.0128 1.0246 0.9996 1.0450 0.9910 0.9900 1.0243 1.0475 1.0129 1.0014 1.0213 1.0062 1.0118 1.0039 0.9967
dispcorr: -0.036971712 hartree
energy: -1554.045631279051
dipole: -20.16737 20.13364 -0.03374 0.73128 -0.29484 0.43644 6.37624 -6.35897 0.01728
magnitude: 0.43808 au
magnitude: 1.11352 debye
