program: Orca
programVersion: 5.0.2
elementType: Cl S O N N C C C C C C C C C C C C C C C C C C C H H H H H H H H H H H H H H H H H H H H H H H H H
charge: 0
multiplicity: 1
keywords: wb97x-d3
keywords: def2-TZVPP
keywords: def2/J RIJCOSX
keywords: DEFGRID2
keywords: scfconv7
keywords: smallprint printgap noloewdin
keywords: NOSOSCF
formula: C19H25ClN2OS
InChI: InChI=1/C19H25ClN2OS/c1-18(2,3)14-9-7-13(8-10-14)12-24-15-11-21-22(19(4,5)6)17(23)16(15)20/h7-11H,12H2,1-6H3
49 atoms
Cl 0.01465 -0.507941 -2.413754
S  -0.38579 -3.363199 -0.86869
O  -1.312261 1.638921 -1.037042
N  -2.429493 0.385871 0.521853
N  -2.69006 -0.783796 1.086507
C  3.133084 2.039419 0.051463
C  -3.081225 1.579052 1.170943
C  2.634708 0.620927 0.296354
C  2.555218 3.038315 1.052487
C  4.661768 2.089885 0.144376
C  2.691136 2.459789 -1.35705
C  -4.00492 1.108077 2.289731
C  -3.932747 2.333208 0.149673
C  -2.005297 2.473254 1.787358
C  3.116703 -0.430951 -0.489836
C  1.653438 0.317943 1.234383
C  1.572269 -1.988581 0.51208
C  2.593107 -1.70602 -0.392566
C  1.135182 -0.966987 1.344674
C  -1.583991 0.547743 -0.554014
C  0.867279 -3.303075 0.495172
C  -1.229335 -1.875904 -0.453014
C  -1.006901 -0.68879 -1.064536
C  -2.130314 -1.856624 0.643845
H  2.946141 4.035109 0.842117
H  1.466639 3.098788 0.992474
H  2.823774 2.79186 2.081303
H  5.018248 3.10371 -0.048711
H  5.008689 1.799278 1.137682
H  5.142564 1.433969 -0.582289
H  3.008047 3.483528 -1.56734
H  3.120845 1.817019 -2.126892
H  1.604549 2.417604 -1.456241
H  -3.474843 0.590782 3.087031
H  -4.805766 0.464634 1.928837
H  -4.465925 1.995718 2.722562
H  -4.663642 1.669714 -0.314292
H  -3.352271 2.811765 -0.63269
H  -4.484909 3.114884 0.67157
H  -2.493141 3.288523 2.322407
H  -1.338008 2.9170 1.053181
H  -1.40628 1.918518 2.511098
H  3.892193 -0.246468 -1.223023
H  1.252656 1.08634 1.8818
H  2.958622 -2.486087 -1.050199
H  0.355006 -1.162689 2.071258
H  1.535552 -4.135617 0.272152
H  0.363667 -3.5119 1.438346
H  -2.383231 -2.773151 1.160032
elementType: Cl S O N C H
totalener: -1782.29298930 hartree
nucrepener: 2580.96221780 hartree
electener: -4363.25520711 hartree
oneelecener: -7574.03624873 hartree
twoeener: 3210.78104163 hartree
cpcmener: -0.02854811 hartree
kineticenergy: 1776.75473861 hartree
xcener: -132.579390564813 hartree
chargesum: 0.0000000
charge: -0.034643 -0.106613 -0.539155 0.158469 -0.265756 0.356629 0.194330 -0.049513 -0.349581 -0.329635 -0.334508 -0.248204 -0.327403 -0.349649 -0.184661 -0.228505 0.030377 -0.232613 -0.151105 0.295189 -0.127574 0.074289 -0.000621 -0.050474 0.102027 0.088634 0.104843 0.098126 0.100639 0.097314 0.100684 0.098540 0.081797 0.099545 0.102166 0.097376 0.107103 0.109489 0.103186 0.110299 0.108028 0.108268 0.141003 0.146511 0.135243 0.145186 0.143973 0.138172 0.132779
qa: -0.0346 -0.1066 -0.5392 0.1585 -0.2658 0.3566 0.1943 -0.0495 -0.3496 -0.3296 -0.3345 -0.2482 -0.3274 -0.3496 -0.1847 -0.2285 0.0304 -0.2326 -0.1511 0.2952 -0.1276 0.0743 -0.0006 -0.0505 0.1020 0.0886 0.1048 0.0981 0.1006 0.0973 0.1007 0.0985 0.0818 0.0995 0.1022 0.0974 0.1071 0.1095 0.1032 0.1103 0.1080 0.1083 0.1410 0.1465 0.1352 0.1452 0.1440 0.1382 0.1328
va: 1.3046 2.2030 1.9448 3.2429 2.9418 3.5897 3.8052 3.6656 3.9331 3.9138 3.9196 3.8480 3.9020 3.9127 3.9464 3.9070 3.5418 4.0206 3.9162 4.2949 3.9094 3.8205 3.9510 4.1256 1.0077 1.0005 1.0008 1.0030 1.0032 1.0047 1.0078 1.0030 1.0238 1.0147 1.0137 1.0042 1.0039 1.0216 1.0030 1.0064 1.0185 1.0025 1.0024 0.9965 1.0083 1.0005 0.9978 1.0026 1.0106
dispcorr: -0.031989733 hartree
energy: -1782.324979036163
dipole: 7.41096 -7.61126 -0.20030 28.85466 -29.65435 -0.79969 19.83938 -18.08462 1.75476
magnitude: 1.93877 au
magnitude: 4.92795 debye
