program: Orca
programVersion: 5.0.2
elementType: Cl S O N N C C C C C C C C C C C C C C C C C C C H H H H H H H H H H H H H H H H H H H H H H H H H
charge: 0
multiplicity: 1
keywords: wb97x-d3
keywords: def2-TZVPP
keywords: def2/J RIJCOSX
keywords: DEFGRID2
keywords: scfconv7
keywords: smallprint printgap noloewdin
keywords: NOSOSCF
formula: C19H25ClN2OS
InChI: InChI=1/C19H25ClN2OS/c1-18(2,3)14-9-7-13(8-10-14)12-24-15-11-21-22(19(4,5)6)17(23)16(15)20/h7-11H,12H2,1-6H3
49 atoms
Cl -1.896601 -2.563067 2.523189
S  0.107422 -2.868084 0.150339
O  -3.715438 -0.325428 2.212954
N  -2.8481 0.505752 0.257533
N  -2.030422 0.381815 -0.769532
C  4.575315 2.256493 -0.912778
C  -3.774637 1.690888 0.212221
C  3.695125 1.01327 -0.971747
C  5.304657 2.386702 0.422852
C  5.623955 2.191205 -2.029114
C  3.701104 3.500721 -1.111287
C  -3.421196 2.563732 -0.988341
C  -3.596936 2.540336 1.471336
C  -5.216108 1.210908 0.049999
C  2.962854 0.733293 -2.126715
C  3.566576 0.122505 0.092058
C  2.01852 -1.261256 -1.142218
C  2.140455 -0.37834 -2.21148
C  2.74535 -0.994177 0.01035
C  -2.903359 -0.401606 1.29894
C  1.161745 -2.487645 -1.28105
C  -1.043681 -1.56553 0.185057
C  -1.912629 -1.448969 1.22431
C  -1.178126 -0.582566 -0.833593
H  5.926268 3.283465 0.414698
H  4.614256 2.477526 1.26324
H  5.962189 1.537283 0.616699
H  6.25257 3.084108 -2.011038
H  6.276122 1.323867 -1.910158
H  5.168328 2.132808 -3.01842
H  4.311195 4.405233 -1.06617
H  3.195174 3.495461 -2.077654
H  2.936992 3.575287 -0.335309
H  -4.092626 3.422022 -0.971944
H  -3.560944 2.05503 -1.939831
H  -2.401308 2.942696 -0.944111
H  -3.942947 2.053011 2.377091
H  -4.173751 3.457379 1.35328
H  -2.553291 2.825683 1.606596
H  -5.580746 0.648008 0.904876
H  -5.323129 0.594315 -0.843269
H  -5.86389 2.079612 -0.07079
H  3.024758 1.3941 -2.982806
H  4.110165 0.286391 1.01232
H  1.584718 -0.560649 -3.124092
H  2.67357 -1.657703 0.863794
H  0.562523 -2.457133 -2.191217
H  1.782722 -3.383927 -1.355922
H  -0.574177 -0.596943 -1.727069
elementType: Cl S O N C H
totalener: -1782.30047721 hartree
nucrepener: 2385.32911635 hartree
electener: -4167.62959356 hartree
oneelecener: -7181.87885915 hartree
twoeener: 3014.24926559 hartree
cpcmener: -0.03160071 hartree
kineticenergy: 1776.73809921 hartree
xcener: -132.582351436574 hartree
chargesum: -0.0000000
charge: -0.058019 -0.053044 -0.548329 0.132694 -0.261754 0.334101 0.177548 -0.111297 -0.358783 -0.328567 -0.328094 -0.246562 -0.324743 -0.328592 -0.167219 -0.164033 -0.046260 -0.213181 -0.173310 0.349965 -0.051204 0.084471 -0.083020 -0.052082 0.100631 0.101033 0.101619 0.097095 0.101102 0.097603 0.096879 0.097291 0.102125 0.096992 0.098920 0.103158 0.108933 0.101851 0.107792 0.106520 0.107371 0.103215 0.144661 0.148209 0.148057 0.129284 0.132592 0.150730 0.135650
qa: -0.0580 -0.0530 -0.5483 0.1327 -0.2618 0.3341 0.1775 -0.1113 -0.3588 -0.3286 -0.3281 -0.2466 -0.3247 -0.3286 -0.1672 -0.1640 -0.0463 -0.2132 -0.1733 0.3500 -0.0512 0.0845 -0.0830 -0.0521 0.1006 0.1010 0.1016 0.0971 0.1011 0.0976 0.0969 0.0973 0.1021 0.0970 0.0989 0.1032 0.1089 0.1019 0.1078 0.1065 0.1074 0.1032 0.1447 0.1482 0.1481 0.1293 0.1326 0.1507 0.1357
va: 1.2957 2.4005 1.9539 3.2218 2.9659 3.6216 3.8324 3.7448 3.9272 3.9183 3.9173 3.8422 3.8937 3.9121 3.9722 3.9324 3.6318 3.9675 3.9881 4.2761 3.8490 3.8269 3.8802 4.0831 1.0066 1.0006 1.0007 1.0034 1.0037 1.0042 1.0036 1.0040 1.0034 1.0041 1.0155 1.0131 1.0235 1.0032 1.0045 1.0225 1.0035 1.0027 1.0008 0.9975 1.0023 1.0232 1.0099 0.9928 1.0091
dispcorr: -0.024680009 hartree
energy: -1782.325157214919
dipole: 21.37103 -19.52312 1.84791 39.78733 -38.91297 0.87436 -18.66674 16.05825 -2.60848
magnitude: 3.31413 au
magnitude: 8.42385 debye
