program: Orca
programVersion: 5.0.2
elementType: Cl S O N N C C C C C C C C C C C C C C C C C C C H H H H H H H H H H H H H H H H H H H H H H H H H
charge: 0
multiplicity: 1
keywords: wb97x-d3
keywords: def2-TZVPP
keywords: def2/J RIJCOSX
keywords: DEFGRID2
keywords: scfconv7
keywords: smallprint printgap noloewdin
keywords: NOSOSCF
formula: C19H25ClN2OS
InChI: InChI=1/C19H25ClN2OS/c1-18(2,3)14-9-7-13(8-10-14)12-24-15-11-21-22(19(4,5)6)17(23)16(15)20/h7-11H,12H2,1-6H3
49 atoms
Cl -1.228844 -2.074367 2.815268
S  -0.11401 -3.390558 0.143517
O  -2.531062 0.472432 2.347118
N  -2.217655 0.570761 0.07694
N  -1.82981 0.00055 -1.052433
C  3.304461 2.339579 -0.834065
C  -2.811438 1.946713 -0.059458
C  2.802894 0.905934 -0.955872
C  4.705087 2.350332 -0.210531
C  3.375786 3.044185 -2.187591
C  2.341136 3.122973 0.067569
C  -4.28077 1.920934 0.360839
C  -2.737721 2.390831 -1.517367
C  -2.00074 2.942514 0.771731
C  2.717984 0.097413 0.18273
C  2.37725 0.353202 -2.159243
C  1.754425 -1.719813 -1.079795
C  2.207056 -1.186736 0.125972
C  1.855571 -0.934509 -2.218957
C  -2.117613 -0.036645 1.313215
C  1.130495 -3.081913 -1.164415
C  -0.983867 -1.876596 0.148554
C  -1.446831 -1.322201 1.295569
C  -1.25635 -1.151991 -1.044682
H  5.069561 3.375575 -0.118953
H  4.715465 1.911804 0.788056
H  5.417685 1.798115 -0.826014
H  3.744631 4.062148 -2.052529
H  4.054726 2.540114 -2.877897
H  2.397987 3.115427 -2.667072
H  2.275454 2.692118 1.067791
H  2.676468 4.156808 0.175676
H  1.33311 3.142596 -0.353118
H  -4.421729 1.703198 1.416332
H  -4.840071 1.188019 -0.222289
H  -4.719645 2.900217 0.167267
H  -3.15851 3.395028 -1.570597
H  -3.317294 1.755603 -2.184988
H  -1.714497 2.442908 -1.888244
H  -0.947491 2.924994 0.485086
H  -2.070964 2.771915 1.84231
H  -2.3774 3.946807 0.575482
H  3.039614 0.481081 1.143435
H  2.422573 0.925389 -3.075574
H  2.135197 -1.768518 1.037303
H  1.504795 -1.32083 -3.168866
H  0.693759 -3.252532 -2.147761
H  1.861944 -3.875563 -0.996407
H  -0.998429 -1.553012 -2.01444
elementType: Cl S O N C H
totalener: -1782.29726509 hartree
nucrepener: 2501.94833050 hartree
electener: -4284.24559559 hartree
oneelecener: -7415.35525522 hartree
twoeener: 3131.10965963 hartree
cpcmener: -0.03066579 hartree
kineticenergy: 1776.72838565 hartree
xcener: -132.578758236469 hartree
chargesum: -0.0000000
charge: -0.050236 -0.072983 -0.541978 0.134578 -0.251270 0.346010 0.178238 -0.102024 -0.331596 -0.358822 -0.341700 -0.333328 -0.243027 -0.323999 -0.168129 -0.164689 -0.008003 -0.230657 -0.163599 0.352813 -0.075599 0.103330 -0.078565 -0.090665 0.097926 0.098149 0.101786 0.100680 0.103999 0.099938 0.101565 0.101260 0.100050 0.108062 0.106907 0.103618 0.097401 0.099955 0.098801 0.098467 0.111027 0.104107 0.144221 0.147073 0.128380 0.140777 0.127900 0.147092 0.146761
qa: -0.0502 -0.0730 -0.5420 0.1346 -0.2513 0.3460 0.1782 -0.1020 -0.3316 -0.3588 -0.3417 -0.3333 -0.2430 -0.3240 -0.1681 -0.1647 -0.0080 -0.2307 -0.1636 0.3528 -0.0756 0.1033 -0.0786 -0.0907 0.0979 0.0981 0.1018 0.1007 0.1040 0.0999 0.1016 0.1013 0.1000 0.1081 0.1069 0.1036 0.0974 0.1000 0.0988 0.0985 0.1110 0.1041 0.1442 0.1471 0.1284 0.1408 0.1279 0.1471 0.1468
va: 1.2984 2.3379 1.9596 3.2181 2.9391 3.6126 3.8256 3.7359 3.9166 3.9255 3.9276 3.9082 3.8464 3.9002 3.9766 3.8930 3.5866 3.9906 3.9531 4.2811 3.8906 3.7970 3.9300 4.1276 1.0032 1.0043 1.0032 1.0071 1.0001 1.0007 1.0029 1.0053 0.9991 1.0221 1.0036 1.0025 1.0044 1.0151 1.0144 1.0060 1.0243 1.0040 1.0016 0.9975 1.0223 1.0057 1.0108 0.9961 0.9956
dispcorr: -0.028072136 hartree
energy: -1782.325337230870
dipole: 15.34432 -14.15279 1.19153 40.24842 -39.98926 0.25916 -20.17619 17.52477 -2.65142
magnitude: 2.91838 au
magnitude: 7.41793 debye
