program: Orca
programVersion: 5.0.2
elementType: Cl S O N N C C C C C C C C C C C C C C C C C C C H H H H H H H H H H H H H H H H H H H H H H H H H
charge: 0
multiplicity: 1
keywords: wb97x-d3
keywords: def2-TZVPP
keywords: def2/J RIJCOSX
keywords: DEFGRID2
keywords: scfconv7
keywords: smallprint printgap noloewdin
keywords: NOSOSCF
formula: C19H25ClN2OS
InChI: InChI=1/C19H25ClN2OS/c1-18(2,3)14-9-7-13(8-10-14)12-24-15-11-21-22(19(4,5)6)17(23)16(15)20/h7-11H,12H2,1-6H3
49 atoms
Cl -1.12724 -2.091499 2.821902
S  -0.121348 -3.40513 0.097728
O  -2.422649 0.469543 2.411204
N  -2.200505 0.569003 0.12995
N  -1.869597 -0.005501 -1.015198
C  3.247587 2.346268 -0.86404
C  -2.795936 1.946567 0.016085
C  2.754766 0.906712 -0.944089
C  3.861322 2.674528 0.495801
C  4.309512 2.587896 -1.942771
C  2.060687 3.289263 -1.100562
C  -4.253047 1.917782 0.475433
C  -2.760745 2.397154 -1.441333
C  -1.963761 2.940281 0.827636
C  2.800878 0.025352 0.13551
C  2.201742 0.428651 -2.132709
C  1.719169 -1.719642 -1.138048
C  2.292544 -1.262914 0.04258
C  1.691771 -0.856087 -2.228661
C  -2.056836 -0.041934 1.360236
C  1.089163 -3.076866 -1.240609
C  -0.985304 -1.888635 0.147923
C  -1.397401 -1.333037 1.313753
C  -1.306125 -1.162627 -1.032093
H  4.205419 3.710053 0.501819
H  3.142064 2.567592 1.309899
H  4.72327 2.044066 0.721785
H  4.673517 3.615992 -1.891521
H  5.166555 1.925109 -1.810804
H  3.917813 2.430976 -2.948502
H  1.283483 3.146658 -0.34611
H  2.385266 4.330881 -1.05012
H  1.604329 3.135761 -2.079629
H  -4.366503 1.682529 1.530509
H  -4.829856 1.19605 -0.10449
H  -4.694686 2.90101 0.310135
H  -3.179161 3.403069 -1.478404
H  -3.359996 1.767508 -2.096527
H  -1.74759 2.448078 -1.839494
H  -0.919895 2.929198 0.508768
H  -2.000318 2.764957 1.898831
H  -2.350449 3.943554 0.647167
H  3.225718 0.337167 1.079953
H  2.143847 1.071407 -3.002691
H  2.323913 -1.906261 0.914073
H  1.246529 -1.18466 -3.160496
H  0.621934 -3.222132 -2.213928
H  1.819778 -3.878169 -1.111068
H  -1.095588 -1.566629 -2.012075
elementType: Cl S O N C H
totalener: -1782.29719194 hartree
nucrepener: 2505.45820852 hartree
electener: -4287.75540046 hartree
oneelecener: -7422.39745717 hartree
twoeener: 3134.64205671 hartree
cpcmener: -0.03104902 hartree
kineticenergy: 1776.73019478 hartree
xcener: -132.578809080409 hartree
chargesum: -0.0000000
charge: -0.049981 -0.074184 -0.542325 0.134433 -0.250901 0.349989 0.180528 -0.104866 -0.358271 -0.332700 -0.340276 -0.334712 -0.243882 -0.322484 -0.145397 -0.177777 0.008663 -0.213716 -0.205575 0.354471 -0.078249 0.106215 -0.081115 -0.095452 0.100205 0.100309 0.103399 0.097928 0.101796 0.097829 0.100808 0.101038 0.098925 0.107810 0.106939 0.103468 0.097713 0.099753 0.098168 0.098328 0.111221 0.103706 0.147556 0.143499 0.128917 0.143845 0.128806 0.148141 0.147457
qa: -0.0500 -0.0742 -0.5423 0.1344 -0.2509 0.3500 0.1805 -0.1049 -0.3583 -0.3327 -0.3403 -0.3347 -0.2439 -0.3225 -0.1454 -0.1778 0.0087 -0.2137 -0.2056 0.3545 -0.0782 0.1062 -0.0811 -0.0955 0.1002 0.1003 0.1034 0.0979 0.1018 0.0978 0.1008 0.1010 0.0989 0.1078 0.1069 0.1035 0.0977 0.0998 0.0982 0.0983 0.1112 0.1037 0.1476 0.1435 0.1289 0.1438 0.1288 0.1481 0.1475
va: 1.2978 2.3332 1.9593 3.2182 2.9364 3.6044 3.8219 3.7383 3.9277 3.9153 3.9375 3.9114 3.8491 3.8987 3.8911 3.9595 3.5643 3.9974 3.9678 4.2758 3.8901 3.7942 3.9321 4.1304 1.0073 1.0001 1.0002 1.0033 1.0032 1.0042 0.9930 1.0058 1.0028 1.0219 1.0034 1.0025 1.0042 1.0156 1.0131 1.0022 1.0250 1.0036 0.9977 1.0011 1.0220 1.0047 1.0107 0.9966 0.9949
dispcorr: -0.028238462 hartree
energy: -1782.325430401815
dipole: 14.49576 -13.42638 1.06939 40.45357 -40.17269 0.28088 -20.41043 17.67326 -2.73717
magnitude: 2.95205 au
magnitude: 7.50351 debye
