program: Orca
programVersion: 5.0.2
elementType: Cl S O N N C C C C C C C C C C C C C C C C C C C H H H H H H H H H H H H H H H H H H H H H H H H H
charge: 0
multiplicity: 1
keywords: wb97x-d3
keywords: def2-TZVPP
keywords: def2/J RIJCOSX
keywords: DEFGRID2
keywords: scfconv7
keywords: smallprint printgap noloewdin
keywords: NOSOSCF
formula: C19H25ClN2OS
InChI: InChI=1/C19H25ClN2OS/c1-18(2,3)14-9-7-13(8-10-14)12-24-15-11-21-22(19(4,5)6)17(23)16(15)20/h7-11H,12H2,1-6H3
49 atoms
Cl -2.209854 -2.129879 -2.134174
S  -0.189725 -3.435402 -0.043088
O  -3.173792 0.460443 -1.285725
N  -2.008972 0.598617 0.687506
N  -1.248568 0.029686 1.609477
C  3.265555 2.350825 -0.369251
C  -2.447122 2.00695 0.987015
C  2.846934 0.902313 -0.150289
C  3.093791 2.790662 -1.822107
C  2.403339 3.262526 0.512989
C  4.740134 2.515599 0.018198
C  -3.962205 2.049056 1.182061
C  -1.991218 2.940146 -0.136089
C  -1.786278 2.481604 2.278126
C  2.377292 0.08283 -1.175646
C  2.912763 0.346532 1.128515
C  2.001418 -1.751433 0.35074
C  1.962568 -1.219456 -0.932296
C  2.495605 -0.950836 1.376085
C  -2.410698 -0.040002 -0.468945
C  1.473308 -3.120105 0.664687
C  -0.973271 -1.900733 0.238687
C  -1.819068 -1.349157 -0.665269
C  -0.760326 -1.147075 1.425952
H  3.703484 2.200124 -2.508371
H  2.05471 2.724145 -2.150471
H  3.402391 3.831985 -1.928261
H  1.343908 3.168409 0.263465
H  2.516968 3.036083 1.574001
H  2.686162 4.307483 0.369459
H  4.917931 2.266978 1.065455
H  5.382842 1.876768 -0.590322
H  5.059861 3.548822 -0.13199
H  -4.252632 3.060263 1.468782
H  -4.270563 1.377932 1.984772
H  -4.518855 1.791566 0.284801
H  -2.483103 2.752274 -1.086024
H  -0.911876 2.874489 -0.285002
H  -2.219849 3.966443 0.152316
H  -0.698059 2.485337 2.215699
H  -2.081505 1.896469 3.147188
H  -2.109968 3.508859 2.446595
H  2.31057 0.45636 -2.188322
H  3.275546 0.93797 1.960376
H  1.576209 -1.811501 -1.753808
H  2.531481 -1.337967 2.387666
H  2.082842 -3.907149 0.215442
H  1.461283 -3.296399 1.739337
H  -0.175382 -1.544416 2.243152
elementType: Cl S O N C H
totalener: -1782.29645845 hartree
nucrepener: 2516.56619558 hartree
electener: -4298.86265403 hartree
oneelecener: -7444.57108805 hartree
twoeener: 3145.70843402 hartree
cpcmener: -0.03108679 hartree
kineticenergy: 1776.73184454 hartree
xcener: -132.579568433771 hartree
chargesum: 0.0000000
charge: -0.050176 -0.074403 -0.543732 0.136962 -0.247746 0.351449 0.173965 -0.104277 -0.357570 -0.326629 -0.332073 -0.330721 -0.331125 -0.241427 -0.154105 -0.185215 -0.005397 -0.197210 -0.191522 0.349861 -0.077378 0.101939 -0.072181 -0.096793 0.100961 0.100956 0.100789 0.083311 0.100148 0.101792 0.097470 0.101334 0.098261 0.103397 0.106772 0.107927 0.114217 0.104581 0.105831 0.093527 0.100966 0.098823 0.147333 0.143600 0.129192 0.142742 0.146256 0.128280 0.147037
qa: -0.0502 -0.0744 -0.5437 0.1370 -0.2477 0.3514 0.1740 -0.1043 -0.3576 -0.3266 -0.3321 -0.3307 -0.3311 -0.2414 -0.1541 -0.1852 -0.0054 -0.1972 -0.1915 0.3499 -0.0774 0.1019 -0.0722 -0.0968 0.1010 0.1010 0.1008 0.0833 0.1001 0.1018 0.0975 0.1013 0.0983 0.1034 0.1068 0.1079 0.1142 0.1046 0.1058 0.0935 0.1010 0.0988 0.1473 0.1436 0.1292 0.1427 0.1463 0.1283 0.1470
va: 1.2983 2.3350 1.9575 3.2125 2.9343 3.6024 3.8293 3.7293 3.9291 3.9315 3.9183 3.9075 3.8971 3.8484 3.8917 3.9632 3.5823 3.9808 3.9562 4.2808 3.8938 3.7948 3.9293 4.1359 1.0008 1.0003 1.0070 1.0015 1.0034 1.0070 1.0036 1.0038 1.0030 1.0028 1.0035 1.0224 1.0256 1.0000 1.0033 1.0151 1.0165 1.0037 0.9979 1.0015 1.0213 1.0045 0.9971 1.0105 0.9950
dispcorr: -0.028870496 hartree
energy: -1782.325328950011
dipole: 22.14988 -20.00393 2.14595 41.01212 -40.70331 0.30881 13.14778 -11.08627 2.06151
magnitude: 2.99170 au
magnitude: 7.60431 debye
