program: Orca
programVersion: 5.0.2
elementType: Cl S O N N C C C C C C C C C C C C C C C C C C C H H H H H H H H H H H H H H H H H H H H H H H H H
charge: 0
multiplicity: 1
keywords: wb97x-d3
keywords: def2-TZVPP
keywords: def2/J RIJCOSX
keywords: DEFGRID2
keywords: scfconv7
keywords: smallprint printgap noloewdin
keywords: NOSOSCF
formula: C19H25ClN2OS
InChI: InChI=1/C19H25ClN2OS/c1-18(2,3)14-9-7-13(8-10-14)12-24-15-11-21-22(19(4,5)6)17(23)16(15)20/h7-11H,12H2,1-6H3
49 atoms
Cl -1.211044 -2.197035 2.743089
S  -0.187538 -3.476155 0.001638
O  -2.344053 0.443249 2.381047
N  -2.050204 0.601465 0.11113
N  -1.722733 0.043713 -1.044053
C  3.036534 2.392882 -0.797231
C  -2.52619 2.0268 0.031427
C  2.602267 0.934325 -0.879341
C  4.390424 2.550032 -1.498907
C  1.997587 3.278876 -1.49545
C  3.172662 2.874151 0.646247
C  -3.991129 2.11221 0.458641
C  -2.418419 2.519741 -1.408895
C  -1.631854 2.917427 0.895486
C  2.291287 0.366699 -2.116162
C  2.494125 0.112684 0.241766
C  1.712287 -1.743562 -1.091884
C  1.845964 -0.941268 -2.220759
C  2.062224 -1.202119 0.139369
C  -1.98307 -0.056782 1.323046
C  1.136904 -3.123041 -1.222475
C  -0.989537 -1.925583 0.080111
C  -1.403933 -1.385421 1.251642
C  -1.232886 -1.145679 -1.083876
H  4.722177 3.5898 -1.461981
H  5.157691 1.938868 -1.020248
H  4.338068 2.257576 -2.548852
H  2.285789 4.329285 -1.419473
H  1.898086 3.045865 -2.556168
H  1.011752 3.170744 -1.037766
H  3.4572 3.927537 0.655892
H  2.233103 2.783894 1.195459
H  3.939637 2.327447 1.197537
H  -4.336404 3.137959 0.326158
H  -4.150988 1.845415 1.499997
H  -4.616963 1.47084 -0.163383
H  -2.754913 3.556631 -1.420822
H  -3.048978 1.961009 -2.098391
H  -1.394569 2.502226 -1.782362
H  -0.583539 2.816199 0.607987
H  -1.718547 2.718403 1.959854
H  -1.916487 3.957385 0.733219
H  2.373329 0.955729 -3.021447
H  2.730498 0.493922 1.225731
H  1.575422 -1.335283 -3.193424
H  1.9643 -1.795533 1.040998
H  0.765296 -3.295388 -2.231682
H  1.877751 -3.897623 -1.013477
H  -1.016552 -1.532211 -2.069918
elementType: Cl S O N C H
totalener: -1782.29530559 hartree
nucrepener: 2532.45510021 hartree
electener: -4314.75040580 hartree
oneelecener: -7476.33319517 hartree
twoeener: 3161.58278937 hartree
cpcmener: -0.03051070 hartree
kineticenergy: 1776.73093203 hartree
xcener: -132.579679701005 hartree
chargesum: -0.0000000
charge: -0.048900 -0.076597 -0.541498 0.141002 -0.247107 0.339354 0.175781 -0.100708 -0.329629 -0.320213 -0.354060 -0.330028 -0.245554 -0.321358 -0.187571 -0.164790 -0.012990 -0.177131 -0.180577 0.340921 -0.080974 0.099307 -0.059742 -0.100946 0.098657 0.101531 0.097277 0.101462 0.100957 0.077537 0.100531 0.102152 0.099674 0.103994 0.107841 0.106228 0.099267 0.102012 0.094654 0.089416 0.115006 0.106755 0.143235 0.146892 0.141633 0.127307 0.126963 0.145903 0.147123
qa: -0.0489 -0.0766 -0.5415 0.1410 -0.2471 0.3394 0.1758 -0.1007 -0.3296 -0.3202 -0.3541 -0.3300 -0.2456 -0.3214 -0.1876 -0.1648 -0.0130 -0.1771 -0.1806 0.3409 -0.0810 0.0993 -0.0597 -0.1009 0.0987 0.1015 0.0973 0.1015 0.1010 0.0775 0.1005 0.1022 0.0997 0.1040 0.1078 0.1062 0.0993 0.1020 0.0947 0.0894 0.1150 0.1068 0.1432 0.1469 0.1416 0.1273 0.1270 0.1459 0.1471
va: 1.2991 2.3252 1.9597 3.2110 2.9326 3.6133 3.8262 3.7129 3.9171 3.9256 3.9291 3.9079 3.8501 3.9008 3.9647 3.8909 3.5967 3.9461 3.9653 4.2937 3.9013 3.7959 3.9314 4.1427 1.0028 1.0042 1.0035 1.0072 1.0052 1.0049 1.0068 0.9997 1.0014 1.0024 1.0223 1.0038 1.0038 1.0169 1.0149 1.0044 1.0254 1.0037 1.0018 0.9975 1.0040 1.0213 1.0104 0.9969 0.9954
dispcorr: -0.029735269 hartree
energy: -1782.325040858468
dipole: 15.30092 -14.11374 1.18718 41.76794 -41.40446 0.36348 -19.25484 16.58538 -2.66947
magnitude: 2.94407 au
magnitude: 7.48324 debye
